industryServiceType
type: AnnotationProperty
comment: (industryServiceType ?INDUSTRY ?TYPE) means that organizations with the IndustryAttribute ?INDUSTRY provide services of the kind ?TYPE.
domain: IndustryAttribute
type: ObjectProperty
range: IntentionalProcess
type: NamedIndividual
type: BinaryPredicate

realGrowthRateOfGDP
type: AnnotationProperty
comment: (realGrowthRateOfGDP ?AREA ?RATE) means that the annual rate of growth in the Gross Domestic Product (GDP) for the GeopoliticalArea ?AREA is the fraction ?RATE, adjusted for inflation, with GDP calculated on a purchasing power parity basis. See PPPBasedEconomicValuation.
domain: GeopoliticalArea
type: ObjectProperty
range: RealNumber
type: DatatypeProperty
type: NamedIndividual
type: PPPBasedEconomicValuation
type: BinaryPredicate

organizationServiceType
type: AnnotationProperty
comment: (organizationServiceType ?BUSINESS ?TYPE) means that the Organization ?BUSINESS provides services of the kind ?TYPE.
domain: Organization
type: ObjectProperty
range: IntentionalProcess
type: NamedIndividual
type: BinaryPredicate

AgricultureFn
type: ObjectProperty
comment: (AgricultureFn ?PRODUCT) denotes the subclass of Agriculture processes in which the AgriculturalProduct ?PRODUCT is cultivated.
domain: AgriculturalProduct
range subclass: Agriculture
type: NamedIndividual
type: UnaryFunction

FiscalYearFn
type: ObjectProperty
comment: (FiscalYearFn ?PLACE) denotes the subclass of TimeIntervals that are fiscalYearPeriods of the Organization or GeopoliticalArea ?PLACE.
domain: Agent
range subclass: TimeInterval
type: NamedIndividual
type: UnaryFunction

agriculturalProductType
type: ObjectProperty
comment: (agriculturalProductType ?AREA ?TYPE) means that the GeopoliticalArea ?AREA produces a crop or other agricultural product of ?TYPE.
domain: GeopoliticalArea
range: Object
type: NamedIndividual
type: BinaryPredicate

annualElectricityConsumption
type: ObjectProperty
comment: (annualElectricityConsumption ?AREA ?AMOUNT) means that the GeopoliticalArea ?AREA uses ?AMOUNT of electricity (measured in KilowattHours) annually.
domain: GeopoliticalArea
range: PhysicalQuantity
type: NamedIndividual
type: BinaryPredicate

annualElectricityExport
type: ObjectProperty
comment: (annualElectricityExport ?AREA ?AMOUNT) means that the GeopoliticalArea ?AREA exported the total ?AMOUNT of electricity (measured in KilowattHours) annually.
domain: GeopoliticalArea
range: PhysicalQuantity
type: NamedIndividual
type: BinaryPredicate

annualElectricityImport
type: ObjectProperty
comment: (annualElectricityImport ?AREA ?AMOUNT) means that the GeopoliticalArea ?AREA imported the total ?AMOUNT of electricity (measured in KilowattHours) annually.
domain: GeopoliticalArea
range: PhysicalQuantity
type: NamedIndividual
type: BinaryPredicate

annualElectricityProduction
type: ObjectProperty
comment: (annualElectricityProduction ?AREA ?AMOUNT) means that the amount of electricity generated annually in the GeographicalArea ?AREA is ?AMOUNT, measured in KilowattHours.
domain: GeopoliticalArea
range: PhysicalQuantity
type: NamedIndividual
type: BinaryPredicate

annualExpenditures
type: ObjectProperty
comment: (annualExpenditures ?AGENT ?AMOUNT) means that the annual budgetary expenditures of the Agent ?AGENT are ?AMOUNT.
domain: Agent
range: CurrencyMeasure
type: NamedIndividual
type: BinaryPredicate

annualExpendituresOfArea
type: ObjectProperty
comment: (annualExpendituresOfArea ?AREA ?AMOUNT) means that the annual budgetary expenditures of the GeopoliticalArea ?AREA are ?AMOUNT, calculated in U.S. dollars according to the currency exchange rate method.
sub property of: annualExpenditures
range: CurrencyMeasure
domain: GeopoliticalArea
type: NamedIndividual
type: BinaryPredicate

annualExportTotal
type: ObjectProperty
comment: (annualExportTotal ?AREA ?AMOUNT) means that the total value of exports from the GeopoliticalArea ?AREA is ?AMOUNT (in UnitedStatesDollars) annually. Export value is calculated on a Free on Board (F.O.B.) basis.
range: CurrencyMeasure
domain: GeopoliticalArea
type: NamedIndividual
type: BinaryPredicate

annualImportTotal
type: ObjectProperty
comment: (annualImportTotal ?AREA ?AMOUNT) means that the total value of imports to the GeopoliticalArea ?AREA is ?AMOUNT (in UnitedStatesDollars) annually. Import value is calculated on a Cost, Insurance, and Freight (C.I.F.) or a Free on Board (F.O.B.) basis.
range: CurrencyMeasure
domain: GeopoliticalArea
type: NamedIndividual
type: BinaryPredicate

annualRevenues
type: ObjectProperty
comment: (annualRevenues ?AGENT ?AMOUNT) means that the annual budgetary revenues of the Agent ?AGENT are ?AMOUNT.
domain: Agent
range: CurrencyMeasure
range: TimeInterval
type: NamedIndividual
type: BinaryPredicate

annualRevenuesOfArea
type: ObjectProperty
comment: (annualRevenuesOfArea ?AREA ?AMOUNT) means that the annual budgetary revenues of the GeopoliticalArea ?AREA are ?AMOUNT, calculated in U.S. dollars according to the currency exchange rate method.
sub property of: annualRevenues
range: CurrencyMeasure
domain: GeopoliticalArea
type: NamedIndividual
type: BinaryPredicate

capitalExpenditures
type: ObjectProperty
comment: (capitalExpenditures ?AGENT ?AMOUNT) means that the annual capital expenditures of the Agent ?AGENT are ?AMOUNT.
domain: Agent
range: CurrencyMeasure
type: NamedIndividual
type: BinaryPredicate

capitalExpendituresOfArea
type: ObjectProperty
comment: (capitalExpendituresOfArea ?AREA ?AMOUNT) means that the annual capital expenditures of the GeopoliticalArea ?AREA are ?AMOUNT, calculated in U.S. dollars according to the currency exchange rate method. This figure is a portion of the annualExpendituresOfArea for ?AREA.
sub property of: capitalExpenditures
range: CurrencyMeasure
domain: GeopoliticalArea
type: NamedIndividual
type: BinaryPredicate

currencyCode
type: ObjectProperty
comment: (currencyCode ?CODE ?UNIT) means that ?CODE is the InternationalOrganizationForStandardization (ISO) 4217 alphabetic currency code for the national CurrencyMeasure ?UNIT.
sub property of: abbreviation
range: CurrencyMeasure
domain: SymbolicString
range: UnitOfMeasure
type: NamedIndividual
type: BinaryPredicate

currencyExchangePerUSDollar
type: ObjectProperty
comment: (currencyExchangePerUSDollar ?AMOUNT ?PERIOD) means that one UnitedStatesDollar is worth ?AMOUNT (in a non-U.S. CurrencyMeasure), during the TimeInterval indicated by ?PERIOD. The rate of exchange may be based either on international market forces or official fiat.
domain: CurrencyMeasure
range: TimeInterval
type: NamedIndividual
type: BinaryPredicate

currencyExchangeRate
type: ObjectProperty
comment: (currencyExchangeRate ?UNIT ?AMOUNT) means that the currency denomination ?UNIT is worth ?AMOUNT (which is in another CurrencyMeasure).
range: CurrencyMeasure
domain: CurrencyMeasure
domain: UnitOfMeasure
type: NamedIndividual
type: BinaryPredicate

economicAidDonated
type: ObjectProperty
comment: (economicAidDonated ?AGENT ?AMOUNT) means that the GeopoliticalArea ?AREA donated ?AMOUNT of aid (valued in U.S. dollars) to developing countries and multilateral organizations. This figure covers 'net official development assistance' (ODA), which is net financial assistance from nations belonging to the OrganizationForEconomicCooperationAndDevelopment (OECD), with the main goal of promoting economic development and welfare. Such aid contains a grant element of at least 25%. This statistic does not cover private flows of assistance or other official flows (OOF).
range: CurrencyMeasure
domain: GeopoliticalArea
type: NamedIndividual
type: BinaryPredicate

economicAidReceivedNet
type: ObjectProperty
comment: (economicAidReceivedNet ?AREA ?AMOUNT) means that the GeopoliticalArea ?AREA had a net inflow of Official Development Finance (ODF) of ?AMOUNT. ODF includes funds from the World Bank, the IMF, other international organizations, and individual donor nations, including both grants and loans. The figure includes formal commitments of aid not yet disbursed. The figure is the net amount of inflow after deducting repayments, valued in U.S. dollars.
range: CurrencyMeasure
domain: GeopoliticalArea
type: NamedIndividual
type: BinaryPredicate

exportCommodityType
type: ObjectProperty
comment: (exportCommodityType ?AREA ?TYPE) means that the GeopoliticalArea ?AREA exports the commodity ?TYPE.
domain: GeopoliticalArea
range: Object
type: NamedIndividual
type: BinaryPredicate

exportPartner
type: ObjectProperty
comment: (exportPartner ?AGENT1 ?AGENT2) means that the Agent ?AGENT1 exports goods to the Agent ?AGENT2.
range: Agent
domain: Agent
type: NamedIndividual
type: BinaryPredicate
type: IrreflexiveRelation

exportPartnerInPeriod
type: ObjectProperty
comment: (exportPartnerInPeriod ?AGENT1 ?AGENT2 ?PERIOD) means that the Agent ?AGENT1 exports goods to the Agent ?AGENT2 during the TimeInterval indicated by ?PERIOD.
domain: Agent
range: Agent
range: TimeInterval
type: NamedIndividual
type: IrreflexiveRelation
type: TernaryPredicate

externalDebt
type: ObjectProperty
comment: (externalDebt ?COUNTRY ?AMOUNT) means that the GeopoliticalArea ?COUNTRY owes the total sum ?AMOUNT of debt (public and private) to nonresidents. The amount is valued in U.S. dollars but may be repayable in foreign currency, goods, or services.
range: CurrencyMeasure
domain: GeopoliticalArea
type: NamedIndividual
type: BinaryPredicate

highestDecileShareOfHouseholdIncome
type: ObjectProperty
comment: (highestDecileShareOfHouseholdIncome ?AREA ?FRACTION) means that in the GeopoliticalArea ?AREA, the highest decile (90-100%) of households with respect to household income (or consumption) had ?FRACTION amount of the total household income (or consumption). Data from different countries may not be directly comparable due to variation in the basis of the data (e.g., based on income versus based on consumption).
range: RealNumber
range: TimeInterval
type: DatatypeProperty
domain: GeopoliticalArea
type: NamedIndividual
type: BinaryPredicate

importCommodityType
type: ObjectProperty
comment: (importCommodityType ?AREA ?TYPE) means that the GeopoliticalArea ?AREA imports the commodity ?TYPE.
domain: GeopoliticalArea
range: Object
type: NamedIndividual
type: BinaryPredicate

importPartner
type: ObjectProperty
comment: (importPartner ?AGENT1 ?AGENT2) means that the Agent ?AGENT1 imports goods from the Agent ?AGENT2.
range: Agent
domain: Agent
type: NamedIndividual
type: BinaryPredicate
type: IrreflexiveRelation

importPartnerInPeriod
type: ObjectProperty
comment: (importPartnerInPeriod ?AGENT1 ?AGENT2 ?PERIOD) means that the Agent ?AGENT1 imports goods from the Agent ?AGENT2 during the TimeInterval indicated by ?PERIOD.
domain: Agent
range: Agent
range: TimeInterval
type: NamedIndividual
type: IrreflexiveRelation
type: TernaryPredicate

incomeDistributionByGiniIndex
type: ObjectProperty
comment: (incomeDistributionByGiniIndex ?AREA ?INDEX) means that in the GeopoliticalArea ?AREA, the distribution of family income is ?INDEX, as measured by the Gini index for family income distribution.
range: NonnegativeRealNumber
type: DatatypeProperty
domain: GeopoliticalArea
type: NamedIndividual
type: BinaryPredicate

industrialProductionGrowthRate
type: ObjectProperty
comment: (industrialProductionGrowthRate ?AREA ?RATE) means that in the GeopoliticalArea ?AREA, the annual percentage increase in industrial production is ?RATE.
range: RealNumber
type: DatatypeProperty
domain: GeopoliticalArea
type: NamedIndividual
type: BinaryPredicate

inflationRateOfConsumerPrices
type: ObjectProperty
comment: (inflationRateOfConsumerPrices ?AREA ?FRACTION) means that in the GeopoliticalArea ?AREA, the annual change in consumer prices was ?FRACTION, compared with prices from the previous year.
range: RealNumber
type: DatatypeProperty
domain: GeopoliticalArea
type: NamedIndividual
type: BinaryPredicate

laborForceTotal
type: ObjectProperty
comment: (laborForceTotal ?AREA ?AMOUNT) means that the total labor force of the GeopoliticalArea ?AREA is ?AMOUNT. This includes unemployed workers.
range: NonnegativeRealNumber
type: DatatypeProperty
domain: GeopoliticalArea
type: NamedIndividual
type: BinaryPredicate

lowestDecileShareOfHouseholdIncome
type: ObjectProperty
comment: (lowestDecileShareOfHouseholdIncome ?AREA ?FRACTION) means that in the GeopoliticalArea ?AREA, the lowest decile (0-10%) of households with respect to household income (or consumption) had ?FRACTION amount of the total household income (or consumption). Data from different countries may not be directly comparable due to variation in the basis of the data (e.g., based on income versus based on consumption).
range: RealNumber
type: DatatypeProperty
domain: GeopoliticalArea
type: NamedIndividual
type: BinaryPredicate

organizationProductType
type: ObjectProperty
comment: (organizationProductType ?BUSINESS ?TYPE) means that the Organization ?BUSINESS produces products of the kind ?TYPE.
range: Object
domain: Organization
type: NamedIndividual
type: BinaryPredicate

perCapitaGDP
type: ObjectProperty
comment: (perCapitaGDP ?AREA ?AMOUNT) means that the Gross Domestic Product, on a per capita basis, for the GeopoliticalArea ?AREA is ?AMOUNT, calculated in U.S. dollars on a purchasing power parity basis. See PPPBasedEconomicValuation.
range: CurrencyMeasure
domain: GeopoliticalArea
type: NamedIndividual
type: PPPBasedEconomicValuation
type: BinaryPredicate

populationFractionBelowPovertyLine
type: ObjectProperty
comment: (populationFractionBelowPovertyLine ?AREA ?FRACTION) means that in the GeopoliticalArea ?AREA, the segment of the population living below the (locally defined) poverty line is ?FRACTION. Note that the definition of the poverty line varies internationally.
range: RealNumber
type: DatatypeProperty
domain: GeopoliticalArea
type: NamedIndividual
type: BinaryPredicate

resultType
type: ObjectProperty
comment: (resultType ?PROCESS ?TYPE) means that the Process ?PROCESS produces some result(s) of the type ?TYPE.
range: Object
domain: Process
type: NamedIndividual
type: BinaryPredicate

currencyType
type: ObjectProperty
comment: (currencyType ?AREA ?UNIT) means that the official currency used in the GeopoliticalArea ?AREA is the UnitOfMeasure ?UNIT.
range: CurrencyMeasure
domain: GeopoliticalArea
range: UnitOfMeasure
type: NamedIndividual
type: BinaryPredicate

economyType
type: ObjectProperty
comment: (economyType ?POLITY ?TYPE) means that the GeopoliticalArea ?POLITY has an economic system of TYPE.
range: EconomicAttribute
domain: Agent
sub property of: attribute
type: NamedIndividual
type: BinaryPredicate

fiscalYearPeriod
type: ObjectProperty
comment: The predicate fiscalYearPeriod indicates the period that an Agent or Organization uses as its 12-month accounting period. (fiscalYearPeriod ?AGENT Year) means that ?AGENT observes its 12-month accounting period during the regular calendar year (CY), from January to December. For fiscal years with other beginning and ending months (FYs), use (fiscalYearPeriod ?AGENT (RecurrentTimeIntervalFn ?STARTMONTH ?ENDMONTH)). For example, (fiscalYearPeriod (GovernmentFn UnitedStates) (RecurrentTimeIntervalFn October September)). For FYs that begin or end mid-month, days may be specified within RecurrentTimeIntervalFn.
domain: Agent
range: TimeInterval
type: NamedIndividual
type: BinaryPredicate

industryOfArea
type: ObjectProperty
comment: (industryOfArea ?AREA ?SECTOR) means that the GeopoliticalArea ?AREA produces goods or services in the economic area ?SECTOR.
range: IndustryAttribute
domain: GeopoliticalArea
type: NamedIndividual
type: BinaryPredicate

industryProductType
type: ObjectProperty
comment: (industryProductType ?INDUSTRY ?TYPE) means that organizations with the IndustryAttribute ?INDUSTRY produce products of the kind ?TYPE.
domain: IndustryAttribute
range: Object
type: NamedIndividual
type: BinaryPredicate

totalGDP
type: ObjectProperty
comment: (totalGDP ?AREA ?AMOUNT) means that the value of all final goods and services produced within the GeopoliticalArea ?AREA is ?AMOUNT, in U.S. dollars, calculated on a purchasing power parity basis. This represents Gross Domestic Product (GDP). See PPPBasedEconomicValuation.
range: CurrencyMeasure
domain: GeopoliticalArea
type: NamedIndividual
type: PPPBasedEconomicValuation
type: BinaryPredicate

AfghanAfghani
type: Class
subclass of: CurrencyMeasure
comment: AfghanAfghani represents the basic unit of currency of Afghanistan.
type: NamedIndividual
type: UnitOfMeasure

AgriculturalProduct
type: Class
subclass of: OrganicObject
subclass of: Product
comment: AgriculturalProduct is the subclass of Product that comprises the products of agricultural activity.

Aloes
type: Class
subclass of: PlantAgriculturalProduct
comment: Aloes is the class of PlantAgriculturalProducts that are dried juice of the Aloe plant.

alumina
type: Class
label: aluminum oxide
subclass of: CompoundSubstance
comment: Alumina is the naturally occurring oxide of aluminum which is found in corundum and bauxite.

AnimalAgriculturalProduct
type: Class
subclass of: AgriculturalProduct
comment: AnimalAgriculturalProduct is the class of AgriculturalProducts that are animal in nature, including meat, fish, dairy products, hides, furs, animal fats and oils, etc.

AnimalSkin
type: Class
subclass of: BodyCovering
comment: AnimalSkin is the subclass of BodyCovering that includes the skins, or parts of skins, of animals.

Asphalt
type: Class
subclass of: RefinedPetroleumProduct
comment: Asphalt is the subclass of RefinedPetroleumProducts that are asphalts.

BeverageProduct
type: Class
subclass of: Product
comment: BeverageProduct is the class of products that are Beverages, packaged or unpackaged.

BritishPound
type: Class
subclass of: CurrencyMeasure
comment: BritishPound represents the basic unit of currency of the UnitedKingdomOfGreatBritainAndNorthernIreland.
type: NamedIndividual
type: UnitOfMeasure

CanadianDollar
type: Class
subclass of: CurrencyMeasure
comment: CanadianDollar represents the basic unit of currency of Canada.
type: NamedIndividual
type: UnitOfMeasure

CapitalGood
type: Class
subclass of: Product
comment: CapitalGoods are those that are used in the production of other Products. For example, raw materials from which end products are manufactured, or machines and other structures used in the production process.

tapioca
type: Class
label: manioc
label: cassava
subclass of: GroceryProduce
subclass of: root crop

ChemicalProduct
type: Class
subclass of: ManufacturedProduct
subclass of: CompoundSubstance
comment: ChemicalProduct is the subclass of Product comprising all chemical compounds that are end products or industrial products used in the manufacture of end products.

ClothesDrier
type: Class
subclass of: MajorAppliance
comment: ClothesDrier is the class of automatic clothes driers.

ClothesWashingMachine
type: Class
subclass of: MajorAppliance
comment: ClothesWashingMachine is the class of washing machines.

Coca
type: Class
subclass of: PlantAgriculturalProduct
comment: Coca is the class of PlantAgriculturalProducts consisting of the parts, especially leaves, of the coca plant. Coca leaves are the source of Cocaine.

Cocoa
type: Class
subclass of: PlantAgriculturalProduct
subclass of: FruitOrVegetable
comment: Cocoa is the class of powdered PlantAgriculturalProduct derived from cacao beans.

ConsumerGood
type: Class
subclass of: ManufacturedProduct
comment: ConsumerGood is the subclass of ManufacturedProducts that are intended for immediate or short-term consumption.
disjoint: DurableGood

CookingOven
type: Class
subclass of: MajorAppliance
comment: CookingOven is the class of ovens for cooking.

CookingRange
type: Class
subclass of: MajorAppliance
comment: CookingRange is the class of cooktops or ranges.

Copra
type: Class
subclass of: PlantAgriculturalProduct
comment: Copra is the class of dried coconut meat valued for the extracted coconut oil.
related internal concept: VegetableOil

CropProduction
comment: CropProduction is the IndustryAttribute that describes crop farming operations.
sub attribute: AgriculturalSector
type: NamedIndividual
type: IndustryAttribute
industry product type: Plant

Dishwasher
type: Class
subclass of: MajorAppliance
comment: Dishwasher is the class of automatic dishwashers.

DurableGood
type: Class
subclass of: ManufacturedProduct
comment: DurableGood is the subclass of ManufacturedProducts which are designed to last for three years or more.

EconomicDevelopmentLevel
type: Class
subclass of: EconomicAttribute
comment: EconomicDevelopmentLevel is a subclass of EconomicAttribute containing terms used to describe the economic development level of a Nation or GeopoliticalArea. This class is further subdivided into different scales devised or used by different agencies.

EconomicSector
type: Class
subclass of: IndustryAttribute
comment: EconomicSector is the subclass of IndustryAttributes that describe broad characterizations of different kinds of business activities; e.g., manufacturing; services; retail trade; wholesale trade; finance, insurance, and real estate; transportation and utilities; construction; mining; agriculture, forestry, and fishing.

ElectricalPowerGeneration
type: Class
subclass of: PowerGeneration
comment: ElectricalPowerGeneration is the subclass of PowerGeneration processes in which electricity is generated.
type: NamedIndividual
industry product type: Electricity

Fertilizer
type: Class
subclass of: ChemicalProduct
subclass of: Mixture
comment: Fertilizer is the subclass of ChemicalProducts that are used in Agriculture to enrich soils to produce more or better quality crop yields.
related internal concept: PhosphoricAcid
related internal concept: Potash
related internal concept: Nitrogen

FinancialSectorAttribute
type: Class
subclass of: EconomicAttribute
comment: FinancialSectorAttribute is a class of Attributes that are used to indicate which financial sectors are most important in the economy of a Nation or GeopoliticalArea. These terms classify nations (or areas) according to the concentration of their economy into one or more EconomicSectors. See also EconomicSector and IndustryAttribute, which classify business organizations into sectors.

FishProduct
type: Class
subclass of: AnimalAgriculturalProduct
comment: FishProduct is the subclass of AnimalAgriculturalProduct that comprises products derived from fish.
related internal concept: FoodFish

FoodProduct
type: Class
subclass of: Product
comment: FoodProduct is the class of food products, packaged or unpackaged.

Footwear
type: Class
subclass of: Clothing
comment: Footwear is the subclass of Clothing that includes shoes, boots, slippers, and other clothing designed to be worn on feet.

Freezer
type: Class
subclass of: MajorAppliance
comment: Freezer is the class of household freezers.

FrenchFranc
type: Class
subclass of: CurrencyMeasure
comment: FrenchFranc represents the basic unit of currency of France.
type: NamedIndividual
type: UnitOfMeasure

Gemstone
type: Class
subclass of: Object
comment: Gemstone is the subclass of Minerals or petrified organic substances that are especially valued for use in jewelry and other decorative items; some Gemstones are also valuable for mechanical or industrial applications.

GermanMark
type: Class
subclass of: CurrencyMeasure
comment: GermanMark represents the basic unit of currency of Germany.
type: NamedIndividual
type: UnitOfMeasure

HandicraftProduct
type: Class
subclass of: Product
comment: HandicraftProduct is the class of Products that are manufactured by hand with a special skill.

HandwovenCarpet
type: Class
subclass of: HandicraftProduct
subclass of: TextileProduct
comment: HandwovenCarpet is the class of carpets that are woven, tied, knitted, or otherwise manufactured by hand.

HotWaterHeater
type: Class
subclass of: MajorAppliance
comment: HotWaterHeater is the class of hot water heaters.

IMFDevelopmentLevel
type: Class
subclass of: EconomicDevelopmentLevel
comment: IMFDevelopmentLevel is a collection of Attributes representing economic development levels used by the InternationalMonetaryFund (IMF) to characterize national economies. The hierarchy of IMF levels includes: AdvancedEconomy, CountryInTransition, and DevelopingCountry. There is some, but not complete, overlap with concepts used by UnitedNations agencies. See

IndustrialRawMaterial
type: Class
subclass of: CapitalGood
comment: IndustrialRawMaterial is the subclass of objects or substances that are used as inputs to manufacturing or other industrial processes. IndustrialRawMaterials are resources and as such are consumed in the process for which they are used.

IndustrialSupply
type: Class
subclass of: CapitalGood
subclass of: ManufacturedProduct
comment: IndustrialSupply is the class of products that are used in industry but which are not raw materials for products being manufactured. IndustrialSupply includes maintenance, repair, and operation (MRO) supplies, including janitorial, electrical, bearings, tools, machinery, accessories, fire and safety equipment, and other industrial items.

IndustryAttribute
type: Class
subclass of: RelationalAttribute
comment: IndustryAttribute is a class of Attributes which identify an Organization as belonging to a particular industry type. For example, the company Hallmark has the attribute of GreetingCardPublishers.

ItalianLire
type: Class
subclass of: CurrencyMeasure
comment: ItalianLire represents the basic unit of currency of Italy.
type: NamedIndividual
type: UnitOfMeasure

JapaneseYen
type: Class
subclass of: CurrencyMeasure
comment: JapaneseYen represents the basic unit of currency of Japan.
type: NamedIndividual
type: UnitOfMeasure

Jewelry
type: Class
subclass of: WearableItem
comment: Jewelry is the subclass of WearableItems that are worn primarily for decorative purposes (sometimes with social significance, e.g., wedding rings). Jewelry may be made of metals (especially precious metals), gems, or other materials.

qat
type: Class
label: khat
subclass of: PlantAgriculturalProduct
comment: Khat is the class of PlantAgriculturalProducts made from the leaves and buds of the staff tree, which are chewed or brewed as a stimulating tea.

Livestock
type: Class
subclass of: AnimalAgriculturalProduct
comment: Livestock is the class of live animals raised as AgriculturalProducts.

Machinery
type: Class
subclass of: DurableGood
subclass of: IndustrialSupply
subclass of: Device
comment: Machinery is the class of products that includes Machines, tools, and machine parts used in industrial or other commercial processes.

maize
type: Class
label: corn
subclass of: CerealGrain

MajorAppliance
type: Class
subclass of: DurableGood
subclass of: ElectricDevice
comment: MajorAppliance is the subclass of ElectricDevices that are large DurableGoods manufactured for use in household tasks.

ManufacturedProduct
type: Class
subclass of: Product
comment: ManufacturedProduct is the subclass of Product that includes goods that are produced or assembled in factories or other manufacturing processes, in contrast to AgriculturalProducts.

MiningProduct
type: Class
subclass of: Product
comment: MiningProduct is the class of things that are produced from the earth for human use by mining or another form of extraction. This includes metal ores, petroleum, and other products.

MotorOil
type: Class
subclass of: PetroleumLubricant
comment: MotorOil is the subclass of PetroleumLubricants that are used to lubricate motors.

NaturalRubber
type: Class
subclass of: PlantAgriculturalProduct
comment: NaturalRubber is the subclass of PlantAgriculturalProducts made from the sap of plant species which produce natural polymers.

Okoume
type: Class
subclass of: Hardwood
comment: Okoume (Aucoumea klaineana), also called 'gaboon', is a wood of West African origin.

OldTajikSomoni
type: Class
subclass of: CurrencyMeasure
comment: OldTajikSomoni represents a former unit of currency of Tajikistan.
type: NamedIndividual
type: UnitOfMeasure

OpiumPoppyFarming
type: Class
subclass of: CropProduction
comment: OpiumPoppyFarming is the specification of CropProduction that describes OpiumPoppy farming operations.
type: NamedIndividual
industry product type: OpiumPoppy

PPPBasedEconomicValuation
type: Class
subclass of: Relation
comment: PPPBasedEconomicValuation is a class of relations used to state international economic information in U.S. dollar amounts. The U.S. dollar amounts are derived from Purchasing Power Parity conversions of economic totals (e.g., GDP) given in local currency. This contrasts with a method of conversion based on currency exchange rates. The PPP method is used by the CIA World Fact Book for the purpose of presenting economic data for all countries covered. Their basis for PPP dollar price weights is the UN International Comparison Program (UNICP) and the work of Professors Robert Summers and Alan Heston of the University of Pennsylvania.

PackagedBeverageProduct
type: Class
subclass of: Product
comment: PackagedBeverageProduct is the class of Products that consist of a BeverageProduct in some kind of packaging, including cups and bottles.

PackagedFoodProduct
type: Class
subclass of: Product
comment: PackagedFoodProduct is the class of Products that consist of a FoodProduct in a package.

palm oil nut
type: Class
label: coquilla nut
subclass of: Nut
subclass of: PlantAgriculturalProduct

pawpaw
type: Class
label: papaw
subclass of: GroceryProduce
subclass of: TropicalFruit

Pearl
type: Class
subclass of: SemipreciousGemstone
comment: Pearl is a subclass of Gemstone.

hide
type: Class
label: pelt
subclass of: AnimalAgriculturalProduct
subclass of: AnimalSkin
comment: Pelt is the subclass of AnimalSkin that comprises the pelts or hides of animals that are used in the manufacture of wearable or household items.

PetroleumLubricant
type: Class
subclass of: RefinedPetroleumProduct
comment: PetroleumLubricant is the subclass of RefinedPetroleumProducts that are lubricants.

PetroleumProduct
type: Class
subclass of: MiningProduct
subclass of: CompoundSubstance
comment: PetroleumProduct is a broad class that includes both crude oil (Petroleum) and RefinedPetroleumProducts.

PharmaceuticalProduct
type: Class
subclass of: ChemicalProduct
subclass of: ManufacturedProduct
subclass of: BiologicallyActiveSubstance
comment: PharmaceuticalProduct is the subclass of ChemicalProducts that are BiologicallyActiveSubstances used in treating disorders and diseases in humans and other animals.

PhosphoricAcid
type: Class
subclass of: CompoundSubstance
comment: PhosphoricAcid represents phosphoric acid.
related internal concept: Phosphorus

PlantAgriculturalProduct
type: Class
subclass of: AgriculturalProduct
comment: PlantAgriculturalProduct is the class of AgriculturalProducts that are vegetable in nature, in the widest sense, e.g., fruits, grains, green vegetables, cotton, linen, flowers, wine grapes, hops.

PotatoTuber
type: Class
subclass of: EdibleTuber
subclass of: GroceryProduce
comment: PotatoTuber represents the edible tubrous part of the potato plant.

PowerGeneration
type: Class
subclass of: Process
comment: PowerGeneration is the class of Processes in which some kind of power is generated either for immediate use in a Device or to be stored for future use.

ProductPackage
type: Class
subclass of: Object
comment: ProductPackage is the class of objects designed to contain Products for shipping and sale.

Pyrethrum
type: Class
subclass of: PlantAgriculturalProduct
subclass of: BiologicallyActiveSubstance
comment: Pyrethrum is the subclass of BiologicallyActiveSubstance consisting of insecticidal derivations from the flower heads of Chrysanthemums.

RefinedPetroleumProduct
type: Class
subclass of: PetroleumProduct
comment: RefinedPetroleumProduct is the subclass of PetroleumProducts that are refined from Petroleum (crude oil).

Refrigerator
type: Class
subclass of: MajorAppliance
comment: Refrigerator is the class of refrigerators.

root crop
type: Class
label: root vegetable
subclass of: PlantAgriculturalProduct
subclass of: FruitOrVegetable

Soap
type: Class
subclass of: Detergent
comment: Soap is the class of cleaning agents based on fatty acids.

TajikSomoni
type: Class
subclass of: CurrencyMeasure
comment: TajikSomoni represents the basic unit of currency of Tajikistan.
type: NamedIndividual
type: UnitOfMeasure

TeaPlantAerialPart
type: Class
subclass of: FruitOrVegetable
comment: TeaPlantAerialPart is the class of all parts of the tea plant from which tea may be made, including leaves, stems, and twigs.

TextileProduct
type: Class
subclass of: ManufacturedProduct
comment: TextileProduct is the subclass of ManufacturedProducts consisting of Fabrics or finished fabric items (e.g., linens), excluding Clothing.

Turkey
type: Class
subclass of: Poultry
geographic subregion: SoutheasternEurope
type: NamedIndividual
type: IndependentState
type: Nation
economy type: industrial country
economy type: DevelopingCountry
economy type: the South

UNEconomicDevelopmentLevel
type: Class
subclass of: EconomicDevelopmentLevel
comment: UNEconomicDevelopmentLevel is a subclass of EconomicDevelopmentLevel containing terms used to represent economic development classifications used by UnitedNations agencies. The top level of this classification scheme includes the concepts of DevelopedCountry, FormerSovietOrEasternEuropeanCountry, and LessDevelopedCountry.

WearableItem
type: Class
subclass of: Artifact
comment: WearableItem is the subclass of Artifacts that are made to be worn on the body, including Clothing, Footwear, and Jewelry.

GNI per capita
type: Class
label: gross national income per capita
subclass of: EconomicDevelopmentLevel
comment: WorldBankGNIPerCapitaLevel is the subclass of EconomicDevelopmentLevel containing attributes that characterize countries according to their per capita gross national income (GNI), as determined by the WorldBankGroup. The World Bank uses the Atlas method for making cross-country comparisons of national income.

bauxite
type: Class
subclass of: MiningProduct
subclass of: Mixture

iron ore
type: Class
subclass of: MiningProduct
subclass of: Mineral

petroleum
type: Class
label: crude oil
subclass of: PetroleumProduct

PreciousGemstone
type: Class
subclass of: Gemstone
subclass of: MiningProduct
comment: PreciousGemstone is the subclass of Gemstones that bring the highest prices.

SemipreciousGemstone
type: Class
subclass of: Gemstone
subclass of: MiningProduct
comment: SemipreciousGemstone is the subclass of Gemstones that are valuable but not as much as PreciousGemstones.

timber
type: Class
subclass of: ForestProduct

Cement
type: Class
subclass of: ManufacturedProduct
subclass of: CompoundSubstance
comment: Cement is a subclass of CompoundSubstance whose instances may contain various minerals or ores, prepared by heating and pulverizing, and used in binding Concrete or in laying brick or stone.

Concrete
type: Class
subclass of: ManufacturedProduct
subclass of: Mixture
comment: Concrete is a class of CompoundSubstances used as building materials. Concrete is made up of Mineral pieces (sand or gravel) and a Cement material used to bind them together.

ControlledSubstance
type: Class
subclass of: BiologicallyActiveSubstance
comment: ControlledSubstance is the subclass of BiologicallyActiveSubstances whose distribution and use is controlled by government regulation.

Detergent
type: Class
subclass of: CompoundSubstance
comment: Detergent is the class of cleaning agents, including both Soap and synthetic cleaning solutions.

DieselFuel
type: Class
subclass of: RefinedPetroleumProduct
comment: DieselFuel is the subclass of RefinedPetroleumProducts that are fuels for diesel engines.

EconomicAttribute
type: Class
subclass of: RelationalAttribute
comment: EconomicAttribute is the class of terms including all Attributes used to characterize the economic systems or development levels of Nations or dependent GeopoliticalAreas.

EconomicSystemAttribute
type: Class
subclass of: EconomicAttribute
comment: EconomicSystemAttribute is the class of Attributes that describe the type of economic system that a country or area has. For example, CapitalistEconomy or SocialistEconomy.

Exporting
type: Class
subclass of: ChangeOfPossession
subclass of: FinancialTransaction
comment: Exporting is the class of actions in which there is a ChangeOfPossession of goods shipped from a provider in one Nation to a destination in another Nation. Typically, there are Selling and Buying events associated with an Exporting. Either the seller or the exporting country may be considered the origin of Exporting.

Fodder
type: Class
subclass of: OrganicObject
comment: Fodder is the class of OrganicObjects that are used as food for domesticated animals.

Gasoline
type: Class
subclass of: RefinedPetroleumProduct
comment: Gasoline is the subclass of RefinedPetroleumProducts that are fuels for internal combustion engines.

KilowattHour
type: Class
subclass of: FunctionQuantity
comment: KilowattHour is a UnitOfMeasure for energy that represents 1000 Watts (1 kW) of power expended over one hour (1 h) of time. This is the unit commonly used in commercial power contexts. It is equivalent to 3,600,000 Joules.
type: NamedIndividual
type: UnitOfMeasure

Narcotic
type: Class
subclass of: ControlledSubstance
comment: Narcotic is a subclass of addictive BiologicallyActiveSubstances that have damping effects on the nervous system and may be fatal in large doses.

EuroDollar
type: Class
subclass of: CurrencyMeasure
comment: EuroDollar represents the basic unit of currency of the EuropeanUnion.
type: NamedIndividual
type: UnitOfMeasure

HoofedMammal
type: Class
subclass of: AnimalAgriculturalProduct
subclass of: Livestock
comment: HoofedMammal is the subclass of Livestock that are hoofed animals.

Advanced Developing Country
type: NamedIndividual
type: EconomicDevelopmentLevel
comment: AdvancedDevelopingCountry is an Attribute used to describe a LessDevelopedCountry (LDC) that is undergoing rapid industrial development. Also called 'newly industrializing economy' (or 'country').
sub attribute: the South

AdvancedEconomy
type: NamedIndividual
type: IMFDevelopmentLevel
comment: AdvancedEconomy is an Attribute used to represent the InternationalMonetaryFund's top category of development levels (AdvancedEconomy,, countries in transition, and developing countries. Generally (but not exactly) corresponds with DevelopedCountry classification used by UnitedNations agencies.

AgriculturalSector
type: NamedIndividual
type: EconomicSector
comment: AgriculturalSector is an attribute that describes commercial organizations or agents whose business is in the agricultural sector of the economy.

AgricultureBasedEconomy
type: NamedIndividual
type: FinancialSectorAttribute
comment: AgricultureBasedEconomy is the Attribute of an economy that is based primarily or significantly on AgriculturalSector businesses.

AircraftManufacturing
type: NamedIndividual
comment: AircraftManufacturing is the Attribute of an Organization whose primary business involves designing or manufacturing Aircraft or aircraft parts.
sub attribute: AerospaceIndustry
industry product type: Aircraft

AluminaAndAluminumIndustry
type: NamedIndividual
comment: AluminaAndAluminumIndustry is the Attribute of an Organization whose primary business involves processing or producing alumina or aluminum.
industry product type: alumina
industry product type: AluminumMetal
sub attribute: PrimaryMetalManufacturing

AnimalProduction
type: NamedIndividual
type: IndustryAttribute
comment: AnimalProduction is the IndustryAttribute that describes animal agriculture operations.
sub attribute: AgriculturalSector
industry product type: Animal

AsphaltMaterialsIndustry
type: NamedIndividual
comment: AsphaltMaterialsIndustry is the Attribute of an Organization whose primary business involves manufacturing Asphalt materials.
industry product type: Asphalt
sub attribute: PetroleumIndustry

AutomobileIndustry
type: NamedIndividual
comment: AutomobileIndustry is an Attribute of an Organization whose primary business involves manufacturing light duty motor vehicles (including Automobiles, LightTrucks and SUVs).
sub attribute: TransportationEquipmentIndustry
industry product type: Automobile

BarleyFarming
type: NamedIndividual
type: IndustryAttribute
comment: BarleyFarming is the IndustryAttribute that describes barley farming operations.
industry product type: BarleyGrain
sub attribute: CerealGrainFarming

CattleRanchingAndFarming
type: NamedIndividual
comment: CattleRanchingAndFarming is the specification of AnimalProduction that describes cattle ranching and farming operations.
sub attribute: AnimalProduction
industry product type: Cattle

CementManufacturing
type: NamedIndividual
type: IndustryAttribute
comment: CementManufacturing is an Attribute of an Organization whose primary business involves manufacturing Cement.
sub attribute: IndustrialSector
industry product type: Cement

CerealGrainFarming
type: NamedIndividual
type: IndustryAttribute
comment: CerealGrainFarming is the IndustryAttribute that describes cereal grain farming operations.
sub attribute: CropProduction
industry product type: CerealGrain

ChemicalManufacturing
type: NamedIndividual
type: IndustryAttribute
comment: ChemicalManufacturing is an Attribute of an Organization whose primary business involves the manufacture of chemicals.
industry product type: ChemicalProduct
sub attribute: IndustrialSector

ClothingIndustry
type: NamedIndividual
type: IndustryAttribute
comment: ClothingIndustry is the Attribute of an Organization whose primary business involves manufacturing Clothing.
related internal concept: FootwearIndustry
sub attribute: IndustrialSector

CoalIndustry
type: NamedIndividual
type: IndustryAttribute
comment: CoalIndustry is the Attribute of an Organization whose primary business involves producing Coal and coal products.
sub attribute: IndustrialSector
industry product type: Coal

CoalMining
type: NamedIndividual
comment: CoalMining is the Attribute of an Organization whose primary business is mining Coal.
sub attribute: CoalIndustry
sub attribute: MiningIndustry
industry product type: Coal

CommunalLandOwnershipEconomy
type: NamedIndividual
type: EconomicSystemAttribute
comment: CommunalLandOwnershipEconomy is an Attribute that describes an economy in which all or most of the land is communally owned.
sub attribute: SocialistEconomy

ConsumerGoodsIndustry
type: NamedIndividual
type: IndustryAttribute
comment: ConsumerGoodsIndustry is the Attribute of an Organization whose primary business is the production of consumer goods.
industry product type: ConsumerGood
sub attribute: IndustrialSector

ControlledLaborMarketEconomy
type: NamedIndividual
type: FinancialSectorAttribute
comment: ControlledLaborMarketEconomy is the Attribute of an area whose economy has a labor market with wages and working conditions controlled by government policies or laws.

CopperIndustry
type: NamedIndividual
type: IndustryAttribute
comment: CopperIndustry is the Attribute of an Organization whose primary business involves mining, smelting, rolling, drawing, extruding, or alloying Copper.
sub attribute: PrimaryMetalManufacturing

CopperOreMining
type: NamedIndividual
comment: CopperOreMining is the Attribute of an Organization whose primary business involves mining CopperOre.
sub attribute: CopperIndustry
industry product type: CopperOre
sub attribute: MetalOreMining

CornFarming
type: NamedIndividual
type: IndustryAttribute
comment: CornFarming is the IndustryAttribute that describes corn or maize farming operations.
sub attribute: CerealGrainFarming
industry product type: maize

CottonFarming
type: NamedIndividual
comment: CottonFarming is the specification of CropProductionthat describes cotton farming operations.
industry product type: CottonFiber
sub attribute: CropProduction

CountryInTransition
type: NamedIndividual
type: IMFDevelopmentLevel
comment: CountryInTransition is a term used by the InternationalMonetaryFund (IMF) to describe the middle group in its hierarchy of advanced countries, countries in transition, and developing countries. Most of the countries with this attribute are former USSR or Eastern European countries. Generally corresponds with FormerSovietOrEasternEuropeanCountry classification used by UnitedNations agencies.
successor attribute: AdvancedEconomy

industrial country
type: NamedIndividual
type: UNEconomicDevelopmentLevel
label: Developed Country
label: the North
comment: DevelopedCountry (DC) is a term used to describe members of the top group in the UNEconomicDevelopmentLevels. DevelopedCountry includes market-oriented economies of mainly democratic nations, including members of the OrganizationForEconomicCooperationAndDevelopment (OECD). DCs are also known as First World countries, 'the North', and industrial countries. Developed countries generally have high incomes (high per capita GDP or GNI), but there are exceptions to DC membership both above and below that standard. There is significant overlap, but not perfect congruence, between the UN category DevelopedCountry and the IMF category AdvancedEconomy.

DevelopingCountry
type: NamedIndividual
type: IMFDevelopmentLevel
comment: DevelopingCountry is a term used by the InternationalMonetaryFund (IMF) for the bottom group in its hierarchy of advanced countries, countries in transition, and developing countries. Generally corresponds to the attribute LessDevelopedCountry used by UnitedNations agencies. Not to be confused with DevelopedCountry.
successor attribute: CountryInTransition

DiversifiedEconomy
type: NamedIndividual
type: FinancialSectorAttribute
comment: DiversifiedEconomy is the Attribute of an area whose economy is based on significant activities in more than one economic sector.

ElectronicsIndustry
type: NamedIndividual
type: IndustryAttribute
comment: ElectronicsIndustry is the Attribute of an Organization whose primary business involves electronics manufacturing (including but not limited to Computers).
sub attribute: IndustrialSector
industry product type: ElectricDevice

FertilizerIndustry
type: NamedIndividual
type: IndustryAttribute
comment: FertilizerIndustry is the Attribute of an Organization whose primary business involves manufacturing Fertilizer.
sub attribute: ChemicalManufacturing
industry product type: Fertilizer

FoodManufacturing
type: NamedIndividual
type: IndustryAttribute
comment: FoodManufacturing is the Attribute of an Organization whose primary business involves manufacturing Food.
sub attribute: AgriculturalSector
industry product type: FoodProduct
industry product type: Food

FootwearIndustry
type: NamedIndividual
type: IndustryAttribute
comment: FootwearIndustry is the Attribute of an Organization whose primary business involves manufacture of Footwear.
industry product type: Footwear
sub attribute: IndustrialSector

ForestryAndLogging
type: NamedIndividual
comment: ForestryAndLogging is the Attribute of an Organization whose primary business involves manufacturing Timber.
industry product type: ForestProduct
sub attribute: LumberIndustry
industry product type: timber

Former Soviet or Eastern European Country
type: NamedIndividual
type: UNEconomicDevelopmentLevel
label: Former Eastern European
label: Former Soviet
comment: FormerSovietOrEasternEuropeanCountry (former USSR-EE) is an Attribute that characterizes countries that were part of the former Soviet Union or its sphere of influence in Eastern Europe. This level occupies a middle position between DevelopedCountry (DC) and LessDevelopedCountry (LDC) in UNEconomicDevelopmentLevels. Previously, former USSR-EE countries had a CentrallyPlannedEconomy and were Marxist-Leninist states. Many are now evolving away from command economies to market economic systems. During the 1980's, the group included Albania, Bulgaria, Cambodia, China, Cuba, Czechoslovakia, the German Democratic Republic (East Germany), Hungary, North Korea, Laos, Mongolia, Poland, Romania, the USSR, Vietnam and Yugoslavia.
successor attribute: industrial country

Four Dragons
type: NamedIndividual
type: EconomicDevelopmentLevel
label: Four Tigers
comment: FourDragonsEconomy describes four small Asian countries that achieved rapid economic growth in the 1990s. Some systems of EconomicDevelopmentLevel place them as a LessDevelopedCountry, but the IMF includes them in AdvancedEconomy.

FruitAndTreeNutFarming
type: NamedIndividual
type: IndustryAttribute
comment: FruitAndTreeNutFarming is the IndustryAttribute that describes fruit and tree nut farming operations.
sub attribute: CropProduction
industry product type: PlantAgriculturalProduct

FruitFarming
type: NamedIndividual
type: IndustryAttribute
comment: FruitFarming is the specification of FruitAndTreeNutFarming that describes fruit farming operations.
industry product type: Fruit
sub attribute: FruitAndTreeNutFarming

FurnitureIndustry
type: NamedIndividual
type: IndustryAttribute
comment: FurnitureIndustry is the Attribute of an Organization whose primary business involves manufacture of Furniture.
sub attribute: IndustrialSector
industry product type: Furniture

GoatFarming
type: NamedIndividual
comment: GoatFarming is the specification of AnimalProduction that describes goat farming operations.
sub attribute: AnimalProduction
industry product type: Goat

GrapeFarming
type: NamedIndividual
comment: GrapeFarming is the specification of FruitFarming that describes Grape farming operations.
sub attribute: FruitFarming
industry product type: Grape

HandicraftIndustry
type: NamedIndividual
type: IndustryAttribute
comment: HandicraftIndustry is the Attribute of an Organization whose primary business involves manufacturing items by hand.
sub attribute: IndustrialSector
industry product type: Artifact

HandwovenCarpetManufacturing
type: NamedIndividual
comment: HandwovenCarpetManufacturing is the Attribute of an Organization whose primary business involves manufacturing HandwovenCarpets.
sub attribute: HandicraftIndustry
industry product type: HandwovenCarpet

HeavyDutyTruckIndustry
type: NamedIndividual
comment: HeavyDutyTruckIndustry is the Attribute of an Organization whose primary business is manufacturing heavy duty trucks.
sub attribute: MotorVehicleIndustry
industry product type: Truck

HighIncomeCountry
type: NamedIndividual
type: GNI per capita
comment: HighIncomeCountry is an Attribute representing the World Bank classification for any country where the per capita GNI is equal to or greater than 9,266 in UnitedStatesDollars.

HighTechIndustrialEconomy
type: NamedIndividual
type: EconomicDevelopmentLevel
comment: HighTechIndustrialEconomy is an Attribute used to describe industrialized countries whose infrastructure uses the most advanced kinds of technology.

HogAndPigFarming
type: NamedIndividual
comment: HogAndPigFarming is the specification of AnimalProduction that describes hog and pig farming operations.
sub attribute: AnimalProduction
industry product type: Pork

HouseholdApplianceManufacturing
type: NamedIndividual
type: IndustryAttribute
comment: HouseholdApplianceManufacturing is the Attribute of an Organization whose primary business involves manufacturing electrical household appliances.
sub attribute: IndustrialSector
industry product type: ElectricDevice

IndustrialSandMining
type: NamedIndividual
comment: IndustrialSandMining is the Attribute of an Organization whose primary business is mining industrial-quality Sand.
sub attribute: MiningIndustry
industry product type: Sand

IndustrialSector
type: NamedIndividual
type: EconomicSector
comment: IndustrialSector is an attribute that describes commercial organizations or agents whose business is in the industrial sector of the economy.

IronMills
type: NamedIndividual
comment: IronMills is the Attribute of an Organization whose primary business is manufacturing iron.
industry product type: IronMetal
sub attribute: PrimaryMetalManufacturing
industry product type: Iron

IronOreMining
type: NamedIndividual
comment: IronOreMining is the Attribute of an Organization whose primary business is mining IronOre.
sub attribute: MiningIndustry
industry product type: iron ore

KaolinAndBallClayMining
type: NamedIndividual
comment: KaolinAndBallClayMining is the Attribute of an Organization whose primary business is mining Clay.
sub attribute: MiningIndustry
industry product type: Clay

LeadIndustry
type: NamedIndividual
type: IndustryAttribute
comment: LeadIndustry is the Attribute of an Organization whose primary business involves mining or manufacturing lead.
sub attribute: IndustrialSector
industry product type: Lead

LeadManufacturing
type: NamedIndividual
type: IndustryAttribute
comment: LeadManufacturing is the Attribute of an Organization whose primary business involves manufacturing LeadProducts.
sub attribute: LeadIndustry
industry product type: LeadProduct
sub attribute: PrimaryMetalManufacturing

LeadOreMining
type: NamedIndividual
comment: LeadOreMining is the Attribute of an Organization whose primary business involves mining LeadOre.
sub attribute: LeadIndustry
industry product type: LeadOre
sub attribute: MetalOreMining

Undeveloped Country
type: NamedIndividual
type: EconomicDevelopmentLevel
label: Least Developed Countries
label: Undeveloped Economy
comment: LeastDevelopedCountry is a sub-classification of LessDevelopedCountry characterizing those countries that have no significant economic growth, a per capita GDP of less than $1,000 UnitedStatesDollars, and low literacy. Also known as 'undeveloped countries'.
sub attribute: the South

the South
type: NamedIndividual
type: UNEconomicDevelopmentLevel
label: Less Developed Country
comment: LessDevelopedCountry (LDC) is the Attribute used to describe the bottom group in the hierarchy of UNEconomicDevelopmentLevels. Less developed countries are countries or dependent areas with low levels of production, living standards, and technology. Per capita GDP (perCapitaGDPInPeriod), or GDI (Gross Domestic Income), is generally less than $5,000 and often below $1,500. Subgroups of LDC, however, include countries that have higher per capita incomes, as well as advanced technology, and rapid rates of growth. Subgroups of LDC include: advanced developing countries, the Four Dragons (also known as Four Tigers), LeastDevelopedCountry (LLDCs), low-income countries, middle-income countries, newly industrializing economies (NIEs), the South (from the location of most LDC countries, relative to Northern developed countries), Third World (obsolete), UnderdevelopedCountry, UndevelopedCountry.
successor attribute: Former Soviet or Eastern European Country

LowIncomeCountry
type: NamedIndividual
type: GNI per capita
comment: LowIncomeCountry is an Attribute representing the World Bank classification for any country where the per capita GNI is $755 or below in UnitedStatesDollars.
successor attribute: LowerMiddleIncomeCountry

LowerMiddleIncomeCountry
type: NamedIndividual
type: GNI per capita
comment: LowerMiddleIncomeCountry is an Attribute representing the World Bank classification for any country where the per capita GNI is between $756 and $2,995 (inclusive) in UnitedStatesDollars.
successor attribute: UpperMiddleIncomeCountry

LumberIndustry
type: NamedIndividual
type: IndustryAttribute
comment: LumberIndustry is the Attribute of an Organization whose primary business involves logging, manufacturing lumber, or making other wood products.
sub attribute: AgriculturalSector
industry product type: ForestProduct

MachineryManufacturing
type: NamedIndividual
type: IndustryAttribute
comment: MachineryManufacturing is the Attribute of an Organization whose primary business involves manufacturing Machinery.
sub attribute: IndustrialSector
industry product type: Machinery

MajorApplianceManufacturing
type: NamedIndividual
comment: MajorApplianceManufacturing is the Attribute of an Organization whose primary business involves manufacturing MajorAppliances.
sub attribute: HouseholdApplianceManufacturing
industry product type: MajorAppliance

MajorIndustrialEconomy
type: NamedIndividual
type: EconomicDevelopmentLevel
comment: MajorIndustrialEconomy is an Attribute used to describe countries with the largest, industrialized, non-communist economies in the world.

ManufacturingBasedEconomy
type: NamedIndividual
type: FinancialSectorAttribute
comment: ManufacturingBasedEconomy is the Attribute of an area whose economy is based primarily on activities in the manufacturing sector.

MarketSocialism
type: NamedIndividual
type: EconomicSystemAttribute
comment: MarketSocialism is an Attribute that describes an economy that has some socialistic institutions and some limited sectors in which markets operate.
sub attribute: PartialMarketEconomy

MetalOreMining
type: NamedIndividual
comment: MetalOreMining is the Attribute of an Organization whose primary business is mining metallic ore.
sub attribute: MiningIndustry
industry product type: Metal

MetalworkingMachineryManufacturing
type: NamedIndividual
comment: MetalworkingMachineryManufacturing is the Attribute of an Organization whose primary business is manufacturing MachineTools.
industry product type: MachineTool
sub attribute: MachineryManufacturing

MilletFarming
type: NamedIndividual
type: IndustryAttribute
comment: MilletFarming is the IndustryAttribute that describes millet farming operations.
sub attribute: CerealGrainFarming
industry product type: MilletGrain

MiningIndustry
type: NamedIndividual
type: IndustryAttribute
comment: MiningIndustry is an Attribute of an Organization whose primary business involves mining.
sub attribute: IndustrialSector

MotorVehicleIndustry
type: NamedIndividual
type: IndustryAttribute
comment: MotorVehicleIndustry is the Attribute of an Organization whose primary business is manufacturing motor vehicles.
sub attribute: TransportationEquipmentIndustry
industry product type: RoadVehicle

NaturalGasIndustry
type: NamedIndividual
type: IndustryAttribute
comment: NaturalGasIndustry is the Attribute of an Organization whose primary business is producing NaturalGas.
sub attribute: MiningIndustry
industry product type: NaturalGas

Newly Industrializing Economies
type: NamedIndividual
type: EconomicDevelopmentLevel
comment: NewlyIndustrializingEconomy is an Attribute used to describe a LessDevelopedCountry (LDC) that is undergoing rapid industrial development. Also called 'newly industrializing economy' (or 'country').

NickelOreMining
type: NamedIndividual
comment: NickelOreMining is the Attribute of an Organization whose primary business involves mining NickelOre.
sub attribute: MiningIndustry
industry product type: NickelOre

OatFarming
type: NamedIndividual
type: IndustryAttribute
comment: OatFarming is the IndustryAttribute that describes oat farming operations.
sub attribute: CerealGrainFarming
industry product type: OatGrain

OffshoreFinancialSectorEconomy
type: NamedIndividual
type: FinancialSectorAttribute
comment: OffshoreFinancialSectorEconomy is the Attribute of an area whose economy is based primarily or significantly on its offshore financial services, which attract overseas investments or deposits.

OtherSourcePowerGeneration
type: NamedIndividual
type: PowerGeneration
comment: OtherSourcePowerGeneration represents all non-fossil fuel, non-hydroelectric, and non-nuclear power generation processes, e.g., wind power generation.

PartialMarketEconomy
type: NamedIndividual
type: EconomicSystemAttribute
comment: PartialMarketEconomy is the Attribute of any MixedEconomy which operates partially with market mechanisms.
sub attribute: MixedEconomy

PeanutFarming
type: NamedIndividual
comment: PeanutFarming is the specification of CropProduction that describes peanut farming operations.
sub attribute: CropProduction
industry product type: Peanut

PetroleumBasedEconomy
type: NamedIndividual
type: FinancialSectorAttribute
comment: PetroleumBasedEconomy is the Attribute of an area whose economy is based primarily on activities in the petroleum industry.

PetroleumIndustry
type: NamedIndividual
type: IndustryAttribute
comment: PetroleumIndustry is the Attribute of an Organization whose primary business involves drilling, extracting, or further processing of crude petroleum or petroleum products.
sub attribute: IndustrialSector
industry product type: PetroleumProduct

PharmaceuticalPreparationManufacturing
type: NamedIndividual
type: IndustryAttribute
comment: PharmaceuticalPreparationManufacturing is the Attribute of an Organization whose primary business involves manufacturing drugs.
sub attribute: IndustrialSector
industry product type: PharmaceuticalProduct

PotatoFarming
type: NamedIndividual
comment: PotatoFarming is the specification of VegetableFarming that describes potato farming operations.
industry product type: PotatoTuber
sub attribute: VegetableFarming

PrimaryMetalManufacturing
type: NamedIndividual
type: IndustryAttribute
comment: PrimaryMetalManufacturing is an Attribute of an Organization whose primary business involves the smelting or refining of ferrous or non-ferrous metals from ore or scrap to produce forgings or castings; in particular iron, aluminum, copper, lead, zinc, or nickel manufacturing.
sub attribute: MetallurgyIndustry
industry product type: Metal

RefrigeratorAndFreezerIndustry
type: NamedIndividual
comment: RefrigeratorAndFreezerIndustry is the Attribute of an Organization whose primary business involves manufacturing refrigerators or freezers.
industry product type: Freezer
sub attribute: MajorApplianceManufacturing
industry product type: Refrigerator

RiceFarming
type: NamedIndividual
type: IndustryAttribute
comment: RiceFarming is the IndustryAttribute that describes rice farming operations.
sub attribute: CerealGrainFarming
industry product type: RiceGrain

RyeFarming
type: NamedIndividual
type: IndustryAttribute
comment: RyeFarming is the IndustryAttribute that describes rye farming operations.
sub attribute: CerealGrainFarming
industry product type: RyeGrain

ServiceBasedEconomy
type: NamedIndividual
type: FinancialSectorAttribute
comment: ServiceBasedEconomy is the Attribute of an economy that is based primarily or significantly on ServiceSector businesses.

ServiceSector
type: NamedIndividual
type: EconomicSector
comment: ServiceSector is an attribute that describes commercial organizations or agents whose business is in the service sector of the economy.

SheepFarming
type: NamedIndividual
comment: SheepFarming is the specification of AnimalProduction that describes sheep farming operations.
sub attribute: AnimalProduction
industry product type: Sheep

SmallElectricalApplianceManufacturing
type: NamedIndividual
comment: SmallElectricalApplianceManufacturing is the Attribute of an Organization whose primary business involves manufacturing small electrical household appliances.
sub attribute: HouseholdApplianceManufacturing
industry product type: ElectricDevice

SoapIndustry
type: NamedIndividual
type: IndustryAttribute
comment: SoapIndustry is the Attribute of an Organization whose primary business involves manufacturing detergents.
sub attribute: IndustrialSector
industry product type: Detergent

SorghumFarming
type: NamedIndividual
type: IndustryAttribute
comment: SorghumFarming is the IndustryAttribute that describes sorghum farming operations.
sub attribute: CerealGrainFarming
industry product type: SorghumGrain

SteelIndustry
type: NamedIndividual
type: IndustryAttribute
comment: SteelIndustry is the Attribute of an Organization whose primary business involves manufacturing steel or steel products.
sub attribute: PrimaryMetalManufacturing
industry product type: Steel

SteelMills
type: NamedIndividual
comment: SteelMills is the Attribute of an Organization whose primary business involves manufacturing steel.
sub attribute: SteelIndustry
industry product type: Steel

StoneMiningAndQuarrying
type: NamedIndividual
comment: StoneMiningAndQuarrying is the Attribute of an Organization whose primary business involves quarrying or mining stone.
sub attribute: MiningIndustry
industry product type: Rock

SubsistenceAgricultureEconomy
type: NamedIndividual
type: FinancialSectorAttribute
comment: SubsistenceAgricultureEconomy is the Attribute of an economy that is based primarily or significantly on AgriculturalSector activities that operate merely at the subsistence level.
sub attribute: AgricultureBasedEconomy

SugarBeetFarming
type: NamedIndividual
comment: SugarBeetFarming is the specification of CropProduction that describes sugar beet farming operations.
sub attribute: CropProduction
industry product type: SugarBeet

TelecommunicationsIndustry
type: NamedIndividual
type: IndustryAttribute
comment: TelecommunicationsIndustry is the Attribute of an Organization whose primary business involves telecommunications.
sub attribute: ServiceSector
industry service type: Communication

TextileIndustry
type: NamedIndividual
type: IndustryAttribute
comment: TextileIndustry is the Attribute of an Organization whose primary business is making TextileProducts.
sub attribute: IndustrialSector
industry product type: TextileProduct
industry product type: Fabric

TourismBasedEconomy
type: NamedIndividual
type: FinancialSectorAttribute
comment: TourismBasedEconomy is the Attribute of an area whose economy is based primarily on activities in the tourist industry.

TourismIndustry
type: NamedIndividual
type: IndustryAttribute
comment: TourismIndustry is an Attribute that describes organizations that provide services or products for travellers who stay temporarily in a region to experience local attractions. There is an overlap (but not subsumption) between TourismIndustry and each of the following industries: travel services and accommodations, entertainment and recreation, and arts and museums or historical sites.
sub attribute: ServiceSector
industry service type: RecreationOrExercise

TradeBasedEconomy
type: NamedIndividual
type: FinancialSectorAttribute
comment: TradeBasedEconomy is the Attribute of an area whose economy is based primarily on activities in the trade sector.

TransportationEquipmentIndustry
type: NamedIndividual
type: IndustryAttribute
comment: TransportationEquipmentIndustry is an Attribute of an Organization whose primary business involves the manufacturing of TransportationDevices.
sub attribute: IndustrialSector
industry product type: TransportationDevice

TreeNutFarming
type: NamedIndividual
comment: TreeNutFarming is the specification of FruitAndTreeNutFarming that describes tree nut farming operations.
industry product type: EdibleNut
sub attribute: FruitAndTreeNutFarming

TwoTierLaborMarketEconomy
type: NamedIndividual
type: FinancialSectorAttribute
comment: TwoTierLaborMarketEconomy is the Attribute of an area whose economy has a labor market characterized by a division between highly paid professional workers and low-paid unskilled labor. Such economies may provide cheap labor pools for overseas manufacturing.

UnderdevelopedCountry
type: NamedIndividual
type: EconomicDevelopmentLevel
comment: UnderdevelopedCountry is an Attribute describing less developed countries that have potential for above-average economic growth. See also LessDevelopedCountry.
sub attribute: the South

UpperMiddleIncomeCountry
type: NamedIndividual
type: GNI per capita
comment: LowerMiddleIncomeCountry is an Attribute representing the World Bank classification for any country where the per capita GNI is between $2,996 and $9,266 (inclusive) in UnitedStatesDollars.
successor attribute: HighIncomeCountry

VegetableAndMelonFarming
type: NamedIndividual
type: IndustryAttribute
comment: VegetableAndMelonFarming is the IndustryAttribute that describes vegetable and melon farming operations.
sub attribute: CropProduction
industry product type: PlantAgriculturalProduct

VegetableFarming
type: NamedIndividual
type: IndustryAttribute
comment: VegetableFarming is the specification of VegetableAndMelonFarming that describes vegetable farming operations.
industry product type: Vegetable
sub attribute: VegetableAndMelonFarming

VegetableOilIndustry
type: NamedIndividual
type: IndustryAttribute
comment: VegetableOilIndustry is the Attribute of an Organization whose primary business is manufacturing VegetableOil.
sub attribute: AgriculturalSector
industry product type: VegetableOil

WheatFarming
type: NamedIndividual
type: IndustryAttribute
comment: WheatFarming is the IndustryAttribute that describes wheat farming operations.
sub attribute: CerealGrainFarming
industry product type: WheatGrain

WineGrapeFarming
type: NamedIndividual
comment: WineGrapeFarming is the specification of GrapeFarming that describes WineGrape farming operations.
sub attribute: GrapeFarming
industry product type: WineGrape

WoodProductManufacturing
type: NamedIndividual
comment: WoodProductManufacturing is the Attribute of an Organization whose primary business involves manufacturing WoodProducts.
sub attribute: LumberIndustry
industry product type: WoodProduct

ZincIndustry
type: NamedIndividual
type: IndustryAttribute
comment: ZincIndustry is the Attribute of an Organization whose primary business is mining or manufacturing Zinc.
sub attribute: IndustrialSector
industry product type: Zinc

ZincManufacturing
type: NamedIndividual
type: IndustryAttribute
comment: ZincManufacturing is the Attribute of an Organization whose primary business is making ZincProducts.
sub attribute: PrimaryMetalManufacturing
sub attribute: ZincIndustry
industry product type: ZincProduct

ZincOreMining
type: NamedIndividual
type: IndustryAttribute
comment: ZincOreMining is the Attribute of an Organization whose primary business is mining ZincOre.
sub attribute: MetalOreMining
sub attribute: ZincIndustry
industry product type: ZincOre

CapitalistEconomy
type: NamedIndividual
type: EconomicSystemAttribute
comment: CapitalistEconomy is the Attribute used to characterize a country whose economy is based on private ownership of the means of production and distribution, and on private accumulation of capital.

CentrallyPlannedEconomy
type: NamedIndividual
type: EconomicSystemAttribute
comment: CentrallyPlannedEconomy is a term used mainly to describe communist or formerly communist states, many of which are now evolving away from command economies towards market-oriented systems. Also known as a 'command economy'.
sub attribute: GovernmentRegulatedEconomy

DemocraticSocialism
type: NamedIndividual
type: EconomicSystemAttribute
comment: DemocraticSocialism is an Attribute that describes a country in which socialism is promoted by a political party or parties within a democratic government. Under DemocraticSocialism, the government participates in central planning of the economy and may also manage nationalized industries.
sub attribute: SocialistEconomy

GovernmentRegulatedEconomy
type: NamedIndividual
type: EconomicSystemAttribute
comment: GovernmentRegulatedEconomy is an Attribute that describes the economy of a country in which the government determines prices, production, wages, allocation of resources, or other economic factors. An economy that is wholly government planned is a CentrallyPlannedEconomy.

GovernmentSubsidizedEconomy
type: NamedIndividual
type: EconomicSystemAttribute
comment: GovernmentSubsidizedEconomy is an Attribute describing an economy in which the government provides subsidies to various industries, workers, or other groups as part of its economic policy.

MarketEconomy
type: NamedIndividual
type: EconomicSystemAttribute
comment: MarketEconomy is an Attribute that describes an economy in which market forces, specifically supply and demand, provide input for privately managed decisions about pricing and production of goods.

MixedEconomy
type: NamedIndividual
type: EconomicSystemAttribute
comment: MixedEconomy is the Attribute of a country whose economy has elements of more than one pure economic system, e.g., a market economy with government welfare for unemployed workers. A mixed-economy country may be a CountryInTransition, as from a prior communist economy to capitalism, but a mixed economy may also be a stable combination of different economic approaches in different areas of a national economy, e.g., nationally managed health care and education systems in an otherwise private-enterprise economy.

NationalizedIndustryEconomy
type: NamedIndividual
type: EconomicSystemAttribute
comment: NationalizedIndustryEconomy is an Attribute describing an economy in which the major industries, such as energy and transportation, are owned by the national government.
sub attribute: GovernmentRegulatedEconomy

PrivateEnterpriseEconomy
type: NamedIndividual
type: EconomicSystemAttribute
comment: PrivateEnterpriseEconomy is the Attribute used to characterize a country in which private enterprise is the main source of economic wealth.
sub attribute: CapitalistEconomy

PrivatizingEconomy
type: NamedIndividual
type: EconomicSystemAttribute
comment: PrivatizingEconomy is an Attribute that describes a country in which formerly government- owned industries are being transferred into private holdings.
sub attribute: MixedEconomy

PureCapitalistEconomy
type: NamedIndividual
type: EconomicSystemAttribute
comment: PureCapitalistEconomy is an Attribute representing a capitalist economy that has no admixture of socialism.
sub attribute: CapitalistEconomy
contrary attribute: MixedEconomy

PureSocialistEconomy
type: NamedIndividual
type: EconomicSystemAttribute
comment: PureSocialistEconomy is an Attribute representing a socialist economy that has no admixture of capitalism.
contrary attribute: MixedEconomy
contrary attribute: PureCapitalistEconomy
sub attribute: SocialistEconomy

SocialistEconomy
type: NamedIndividual
type: EconomicSystemAttribute
comment: SocialistEconomy is the Attribute used to characterize a country in which there is government ownership or direction of the means of production and distribution.

WelfareCapitalism
type: NamedIndividual
type: EconomicSystemAttribute
comment: WelfareCapitalism is an Attribute describing an economy in which the government provides economic subsidies to unemployed or disabled individuals.
sub attribute: GovernmentSubsidizedEconomy
sub attribute: MixedEconomy

OffshoreBankingSectorEconomy
comment: OffshoreBankingSectorEconomy is the sub-type of OffshoreFinancialSectorEconomy, describing an area whose economy is based primarily or significantly on its offshore banking services.
sub attribute: OffshoreFinancialSectorEconomy

AerospaceIndustry
comment: AerospaceIndustry is the Attribute of an Organization whose primary business involves manufacturing aerospace products.
sub attribute: TransportationEquipmentIndustry