AgreementOrganizationFn
type: ObjectProperty
comment: (AgreementOrganizationFn ?AGR) denotes the official Organization established by the Agreement ?AGR to administer or enforce the terms of that agreement.
domain: Agreement
range: Organization
type: NamedIndividual
type: UnaryFunction

AreaHighPointFn
type: ObjectProperty
comment: (AreaHighPointFn ?AREA) denotes the area within the GeographicArea ?AREA that has the highest elevation.
domain: GeographicArea
range: GeographicArea
type: NamedIndividual
type: UnaryFunction

AreaLowPointFn
type: ObjectProperty
comment: (AreaLowPointFn ?AREA) denotes the area within the GeographicArea ?AREA that has the lowest elevation.
domain: GeographicArea
range: GeographicArea
type: NamedIndividual
type: UnaryFunction

DatumFn
type: ObjectProperty
comment: (DatumFn ?PLACE) denotes the level of Mean Lower Low Water (MLLW) used as the datum reference for tide levels of in the GeographicArea ?PLACE (which is a WaterArea or is covered by water). High and low tides are represented in a tide book using plus or minus heights with reference to this point.
domain: GeographicArea
range: LengthMeasure
type: NamedIndividual
type: UnaryFunction

ExclusiveFishingZoneFn
type: ObjectProperty
comment: (ExclusiveFishingZoneFn ?POLITY) denotes the ExclusiveFishingZone that is claimed by the GeopoliticalArea ?POLITY.
range: ExclusiveFishingZone
domain: GeopoliticalArea
type: NamedIndividual
type: UnaryFunction

ExtendedFishingZoneFn
type: ObjectProperty
comment: (ExtendedFishingZoneFn ?POLITY) denotes the ExtendedFishingZoneFn that is claimed by the GeopoliticalArea ?POLITY, beyond its ExclusiveFishingZone.
range: ExtendedFishingZone
domain: GeopoliticalArea
type: NamedIndividual
type: UnaryFunction

FlowFn
type: ObjectProperty
comment: (FlowFn ?FLUID) denotes the Motion process associated with the constitutive pieces of the FlowRegion ?FLUID.
domain: FlowRegion
range: Motion
type: NamedIndividual
type: UnaryFunction

FlowRegionFn
type: ObjectProperty
comment: (FlowRegionFn ?FLOW) denotes the region in which the coherent Flow process ?FLOW is occurring.
domain: Flow
range: Region
type: NamedIndividual
type: UnaryFunction

geographic center
type: ObjectProperty
comment: (GeographicCenterFn ?REGION) denotes the geographical center of the GeographicArea ?REGION.
range: GeographicArea
domain: GeographicArea
type: NamedIndividual
type: UnaryFunction

MaritimeContiguousZoneFn
type: ObjectProperty
comment: (MaritimeContiguousZoneFn ?POLITY) denotes the MaritimeContiguousZone that is claimed by the GeopoliticalArea ?POLITY.
range: MaritimeContiguousZone
domain: GeopoliticalArea
type: NamedIndividual
type: UnaryFunction

MaritimeExclusiveEconomicZoneFn
type: ObjectProperty
comment: (MaritimeExclusiveEconomicZoneFn ?POLITY) denotes the MaritimeExclusiveEconomicZone that is claimed by the GeopoliticalArea ?POLITY.
range: MaritimeExclusiveEconomicZone
domain: GeopoliticalArea
type: NamedIndividual
type: UnaryFunction

MaritimeShelfAreaFn
type: ObjectProperty
comment: (MaritimeShelfAreaFn ?POLITY) denotes the MaritimeShelfArea that is claimed by the GeopoliticalArea ?POLITY.
range: MaritimeShelfArea
domain: GeopoliticalArea
type: NamedIndividual
type: UnaryFunction

PerimeterAreaFn
type: ObjectProperty
comment: (PerimeterAreaFn ?REGION) denotes a class including any peripheral zones extending outward from the Region ?REGION.
range subclass: PerimeterArea
domain: Region
type: NamedIndividual
type: UnaryFunction

SeacoastFn
type: ObjectProperty
comment: (SeacoastFn ?LAND ?SEA) denotes the Seacoast where the GeographicArea ?LAND borders the SaltWaterArea ?SEA.
range: Seacoast
domain: GeographicArea
type: NamedIndividual
type: UnaryFunction

ShortageFn
type: ObjectProperty
comment: (ShortageFn ?TYPE) means that there is a shortage of objects of ?TYPE, which are used as resources.
domain: Object
range: Physical
type: NamedIndividual
type: UnaryFunction

SquareUnitFn
type: ObjectProperty
comment: (SquareUnitFn ?UNIT) denotes the UnitOfMeasure that is the square of the UnitOfMeasure ?UNIT. For example, (SquareUnitFn (KiloFn Meter)) denotes the unit of a square kilometer.
range subclass: ConstantQuantity
domain: ConstantQuantity
domain: UnitOfMeasure
range: UnitOfMeasure
type: NamedIndividual
type: UnaryFunction

TerritorialSeaFn
type: ObjectProperty
comment: (TerritorialSeaFn ?POLITY) denotes the TerritorialSea that is claimed by the GeopoliticalArea ?POLITY.
range: TerritorialSea
domain: GeopoliticalArea
type: NamedIndividual
type: UnaryFunction

advancingMass
type: ObjectProperty
comment: (advancingMass ?FRONT ?AREA) means that in the WeatherFront ?FRONT, the Air mass ?AREA is the advancing air mass that is overtaking a slower or stationary air mass. See also overtakenMass.
domain: WeatherFront
range: Air
sub property of: patient
type: NamedIndividual
type: BinaryPredicate

airborneAltitude
type: ObjectProperty
comment: (airborneAltitude ?OBJECT ?HEIGHT) means that the Object ?OBJECT is located at the distance ?HEIGHT above the planetary surface.
range: LengthMeasure
domain: Object
type: NamedIndividual
type: BinaryPredicate

arableLandArea
type: ObjectProperty
comment: (arableLandArea ?REGION ?AMOUNT) means that the GeographicArea ?REGION has ?AMOUNT of land under cultivation with crops that are replanted after each harvest. ?AMOUNT may be expressed in physical units or with a percent or fraction. Cf. permanentCropLandArea.
range: ConstantQuantity
domain: GeographicArea
type: NamedIndividual
type: BinaryPredicate

bioindicatorForHabitat
type: ObjectProperty
comment: (bioindicatorForHabitat ?AREA ?SPECIES) means that the health of the individuals in ?SPECIES indicates the condition of their habitat in the GeographicArea ?AREA.
domain: GeographicArea
range: OrganicObject
type: NamedIndividual
type: BinaryPredicate

claimedTerritory
type: ObjectProperty
comment: (claimedTerritory ?AREA ?POLITY) means that some right over the GeographicArea ?AREA is claimed by the Agent or GeopoliticalArea ?POLITY. If two politically independent states or agents claim the same area, that area is a 'disputed territory'.
range: Agent
domain: GeographicArea
type: NamedIndividual
type: BinaryPredicate

cloudCoverFraction
type: ObjectProperty
comment: (cloudCoverFraction ?AREA ?AMOUNT) means that in the Region ?AREA, the fraction ?AMOUNT of the sky is covered with clouds.
range: NonnegativeRealNumber
type: DatatypeProperty
domain: Region
type: NamedIndividual
type: BinaryPredicate

coldSeasonInArea
type: ObjectProperty
comment: (coldSeasonInArea ?AREA ?INTERVAL) means that in the GeographicArea ?AREA, the cold season occurs during the TimeInterval ?INTERVAL.
domain: GeographicArea
range: TimeInterval
type: NamedIndividual
type: AsymmetricRelation
type: BinaryPredicate

connectedDownstream
type: ObjectProperty
comment: (connectedDownstream ?OBJ1 ?OBJ2) means that ?OBJ1 is connected, remotely or immediately, with ?OBJ2 along a directed system such as a RiverSystem.
domain: Object
range: Object
type: NamedIndividual
type: BinaryPredicate

coolSeasonInArea
type: ObjectProperty
comment: (coolSeasonInArea ?AREA ?INTERVAL) means that in the GeographicArea ?AREA, the cool season occurs during the TimeInterval ?INTERVAL. For example, (coolSeasonInArea Angola (RecurrentTimeIntervalFn May October
domain: GeographicArea
range: TimeInterval
type: NamedIndividual
type: AsymmetricRelation
type: BinaryPredicate

dateOpenedForSignature
type: ObjectProperty
comment: (dateOpenedForSignature ?PROP ?DATE) means that as of a date indicated by ?DATE, document(s) may officially be signed (by the appropriate agents) to effect commitments to the Agreement ?PROP.
domain: Proposition
range: TimePosition
type: NamedIndividual
type: BinaryPredicate

drySeasonInArea
type: ObjectProperty
comment: (drySeasonInArea ?AREA ?INTERVAL) means that in the GeographicArea ?AREA, the dry season occurs during the TimeInterval ?INTERVAL. For example, (drySeasonInArea Angola (RecurrentTimeIntervalFn May October)).
domain: GeographicArea
range: TimeInterval
type: NamedIndividual
type: AsymmetricRelation
type: BinaryPredicate

elevation
type: ObjectProperty
comment: (elevation ?OBJECT ?HEIGHT) means that the physical Object ?OBJECT is located on the surface of PlanetEarth at the vertical distance ?HEIGHT above (or below, for a negative quantity) SeaLevel. ?OBJECT may be a superficialPart of Earth's surface, such as a GeographicArea, or an Artifact. Elevation is measured from SeaLevel to the vertical top of the object. For the distance of an object, such as an Aircraft, from the surface of the earth, see airborneAltitude.
range: LengthMeasure
domain: Object
type: NamedIndividual
type: BinaryPredicate

environmentalProblemTypeInArea
type: ObjectProperty
comment: (environmentalProblemTypeInArea ?AREA ?PROBLEM) means that objects or processes of type ?PROBLEM are an environmental problem in the GeographicArea ?AREA.
domain: GeographicArea
range: Physical
type: NamedIndividual
type: BinaryPredicate

flows
type: ObjectProperty
comment: (flows ?FLUID1 ?FLUID2) means that the Physical ?FLUID1 moves towards the Physical ?FLUID2, to which it is connected.
domain: Physical
range: Physical
sub property of: connected
type: NamedIndividual
type: AsymmetricRelation
type: BinaryPredicate
type: TransitiveRelation

groundSubsurfaceType
type: ObjectProperty
comment: (groundSubsurfaceType ?AREA ?SUBSOIL) means that in the the LandArea ?AREA, the predominant component of the subsoil or subsurface layer is of the Substance type ?SUBSOIL.
domain: LandArea
range: Substance
type: NamedIndividual
type: BinaryPredicate

groundSurfaceType
type: ObjectProperty
comment: (groundSurfaceType ?AREA ?SUBSTANCE) means that in the LandArea ?AREA, the predominant component of the ground surface is of the Substance ?SUBSTANCE.
domain: LandArea
range: Substance
type: NamedIndividual
type: BinaryPredicate

headingWRTCompassNorth
type: ObjectProperty
comment: (headingWRTCompassNorth ?OBJ ?DEGREE) means that the front-to-back axis of the Object ?OBJ points in the direction ?DEGREE, according to the compass carried by ?OBJ.
range: PlaneAngleMeasure
type: DatatypeProperty
domain: Object
type: NamedIndividual
type: AsymmetricRelation
type: BinaryPredicate

headingWRTMagneticNorth
type: ObjectProperty
comment: (headingWRTMagneticNorth ?OBJ ?DEGREE) means that the front-to-back axis of the Object ?OBJ points in the direction ?DEGREE, with respect to the MagneticNorthPole.
range: PlaneAngleMeasure
type: DatatypeProperty
domain: Object
type: NamedIndividual
type: AsymmetricRelation
type: BinaryPredicate

headingWRTTrueNorth
type: ObjectProperty
comment: (headingWRTTrueNorth ?OBJ ?DEGREE) means that the front-to-back axis of the Object ?OBJ points in the direction ?DEGREE, with respect to true North.
range: PlaneAngleMeasure
type: DatatypeProperty
domain: Object
type: NamedIndividual
type: AsymmetricRelation
type: BinaryPredicate

highAltitudeWindSpeed
type: ObjectProperty
comment: (highAltitudeWindSpeed ?PLACE ?RATE) means that the Wind blowing above 25,000 feet at ?PLACE has a speed of ?RATE.
range: ConstantQuantity
domain: Object
type: NamedIndividual
type: AsymmetricRelation
type: BinaryPredicate

highAltitudeWindVelocity
type: ObjectProperty
comment: (highAltitudeWindVelocity ?PLACE ?SPEED ?TOWARD) means that the Wind blowing above 25,000 feet at ?PLACE has a speed of ?SPEED and is moving toward the DirectionalAttribute ?TOWARD.
range: DirectionalAttribute
range: PhysicalQuantity
type: NamedIndividual
type: BinaryPredicate

hotSeasonInArea
type: ObjectProperty
comment: (hotSeasonInArea ?AREA ?INTERVAL) means that in the GeographicArea ?AREA, the hot season occurs during the TimeInterval ?INTERVAL. For example, (hotSeasonInArea Angola (RecurrentTimeIntervalFn November April)).
domain: GeographicArea
range: TimeInterval
type: NamedIndividual
type: AsymmetricRelation
type: BinaryPredicate

irrigatedLandArea
type: ObjectProperty
comment: (irrigatedLandArea ?REGION ?AMOUNT) means that the GeographicArea ?REGION has the ?AMOUNT of irrigated land. ?AMOUNT may be expressed in physical units or with a percent or fraction.
domain: ConstantQuantity
domain: GeographicArea
type: NamedIndividual
type: BinaryPredicate

landAreaOnly
type: ObjectProperty
comment: (landAreaOnly ?REGION ?MEASURE) means that the total area(s) of solid ground within the GeographicArea ?REGION has the AreaMeasure ?AMOUNT. The pieces of solid ground need not be continuous within the region. See SurfaceGroundArea.
range: AreaMeasure
domain: GeographicArea
type: NamedIndividual
type: BinaryPredicate

lowAltitudeWindSpeed
type: ObjectProperty
comment: (lowAltitudeWindSpeed ?PLACE ?RATE) means that the Wind blowing between 500-10,000 feet at ?PLACE has a speed of ?RATE. Wind speed may be expressed in knots (KnotUnitOfSpeed) or as any distance per time unit (using (SpeedFn ?DISTANCE ?TIME)).
domain: Object
range: PhysicalQuantity
type: NamedIndividual
type: AsymmetricRelation
type: BinaryPredicate

lowAltitudeWindVelocity
type: ObjectProperty
comment: (lowAltitudeWindVelocity ?PLACE ?SPEED ?DIRECTION) means that the low-altitude Wind blowing at ?PLACE has a speed of ?SPEED and comes from the compass point ?DIRECTION. Low-altitude wind is wind blowing between 500-10,000 feet.
range: DirectionalAttribute
domain: Object
range: PhysicalQuantity
type: NamedIndividual
type: BinaryPredicate

mapOfArea
type: ObjectProperty
comment: (mapOfArea ?AREA ?POINTER) means that a map of the Region ?AREA can be found at the location ?POINTER.
domain: Region
range: SymbolicString
type: NamedIndividual
type: BinaryPredicate

maritimeClaimType
type: ObjectProperty
comment: (maritimeClaimType ?POLITY ?TYPE) means that the GeopoliticalArea ?POLITY claims rights over a MaritimeClaimArea of ?TYPE.
range: MaritimeClaimArea
domain: GeopoliticalArea
type: NamedIndividual
type: AsymmetricRelation
type: BinaryPredicate

meanSeaLevel
type: ObjectProperty
comment: (meanSeaLevel ?PLACE ?MEASURE) means that the Mean Sea Level (MSL) at the GeographicArea ?PLACE is the LengthMeasure (i.e., height) ?MEASURE. MSL represents the sea level at a place, as measured against a benchmark (and averaged over a long time period). For marine purposes, MSL is measured using tide gauges, while geodesists use the difference between the local sea surface and an ideal level ocean surface (the geoid).
domain: GeographicArea
range: LengthMeasure
type: NamedIndividual
type: BinaryPredicate
type: SingleValuedRelation

mediumAltitudeWindSpeed
type: ObjectProperty
comment: (mediumAltitudeWindSpeed ?PLACE ?RATE) means that the Wind blowing between 10,000-25,000 feet at ?PLACE has a speed of ?RATE.
range: ConstantQuantity
domain: Object
type: NamedIndividual
type: AsymmetricRelation
type: BinaryPredicate

mediumAltitudeWindVelocity
type: ObjectProperty
comment: (mediumAltitudeWindVelocity ?PLACE ?SPEED ?TOWARD) means that the Wind blowing between 10,000-25,000 feet at ?PLACE has a speed of ?SPEED and is moving toward the DirectionalAttribute ?TOWARD.
range: DirectionalAttribute
domain: Object
range: PhysicalQuantity
type: NamedIndividual
type: BinaryPredicate

naturalHazardTypeInArea
type: ObjectProperty
comment: (naturalHazardTypeInArea ?AREA ?TYPE) means that in the GeographicArea ?AREA, Processes of ?TYPE occur with some frequency and may cause damage or danger to human lives and property.
domain: GeographicArea
range: Physical
type: NamedIndividual
type: BinaryPredicate

naturalResourceTypeInArea
type: ObjectProperty
comment: (naturalResourceTypeInArea ?REGION ?TYPE) means that the GeographicArea ?REGION has resources of the kind ?TYPE.
domain: GeographicArea
range: Object
type: NamedIndividual
type: BinaryPredicate

oppositeAttribute
type: ObjectProperty
comment: (oppositeAttribute ?ATT1 ?ATT2) means that the Attributes ?ATT1 and ?ATT2 represent opposite qualities, such that an object with either one of those attributes does not have the other. Cf. contraryAttribute.
domain: Attribute
range: Attribute
sub property of: contraryAttribute
type: NamedIndividual
type: BinaryPredicate
type: IrreflexiveRelation
type: SymmetricRelation

oppositeDirection
type: ObjectProperty
comment: (oppositeDirection ?DIR1 ?DIR2) means that the PositionalAttribute ?DIR1 points in the compass direction opposite to the DirectionalAttribute ?DIR2.
range: PositionalAttribute
domain: PositionalAttribute
type: NamedIndividual
type: BinaryPredicate
type: IrreflexiveRelation
type: SymmetricRelation

otherLandUseArea
type: ObjectProperty
comment: This catchall predicate is used to represent information from the CIA World Fact Book. (otherLandUseArea ?REGION ?AMOUNT) means that in the GeographicArea ?REGION, this ?AMOUNT of land has some use other than planting seasonal or permanent crops. ?AMOUNT may be expressed in physical units or with a percent or fraction. See also arableLandArea and permanentCropLandArea.
range: ConstantQuantity
domain: GeographicArea
type: NamedIndividual
type: BinaryPredicate

overcastDaysInPeriod
type: ObjectProperty
comment: (overcastDaysInPeriod ?AREA ?PERIOD ?NUMBER) means that during the time ?PERIOD, the GeographicArea ?AREA experienced ?NUMBER of OvercastWeather days.
range: NonnegativeRealNumber
range: TimeDuration
type: DatatypeProperty
domain: GeographicArea
type: NamedIndividual
type: BinaryPredicate

overtakenMass
type: ObjectProperty
comment: (overtakenMass ?FRONT ?AREA) means that in the WeatherFront ?FRONT, the Air mass ?AREA is the slower or stationary air mass that is being overtaken by an advancing air mass. See advancingMass.
domain: WeatherFront
range: Air
sub property of: patient
type: NamedIndividual
type: BinaryPredicate

partyToAgreement
type: ObjectProperty
comment: (partyToAgreement ?AGENT ?PROP) means that the Agent ?AGENT has committed to the agreement ?PROP.
domain: Agent
range: Proposition
type: NamedIndividual
type: BinaryPredicate

permanentCropLandArea
type: ObjectProperty
comment: (permanentCropLandArea ?REGION ?AMOUNT) means that the GeographicArea ?REGION has ?AMOUNT of land under cultivation with crops that are not replanted after each harvest. This includes orchards, vineyards, coffee and rubber plantations. Timberland is excluded. ?AMOUNT may be expressed in physical units or with a percent or fraction. Cf. permanentCropLandArea.
range: ConstantQuantity
domain: GeographicArea
type: NamedIndividual
type: BinaryPredicate

precipitationAmount
type: ObjectProperty
comment: (precipitationAmount ?EVENT ?AMOUNT) means that in the Precipitation process ?EVENT, the quantity of precipitation that fell was ?AMOUNT.
range: ConstantQuantity
domain: Precipitation
type: NamedIndividual
type: AsymmetricRelation
type: BinaryPredicate

precipitationRate
type: ObjectProperty
comment: (precipitationRate ?EVENT ?RATE) means that in the Precipitation ?EVENT, the precipitation falls at a rate of ?RATE.
range: FunctionQuantity
domain: Precipitation
type: NamedIndividual
type: AsymmetricRelation
type: BinaryPredicate

precipitationState
type: ObjectProperty
comment: (precipitationState ?EVENT ?STATE) means that in the Precipitation ?EVENT, the stuff falling is in the PhysicalState ?STATE (e.g., liquid or solid ice).
range: PhysicalState
domain: WeatherProcess
type: NamedIndividual
type: AsymmetricRelation
type: BinaryPredicate

rainySeasonInArea
type: ObjectProperty
comment: (rainySeasonInArea ?AREA ?INTERVAL) means that in the GeographicArea ?AREA, the rainy or wet season occurs during the TimeInterval ?INTERVAL. For example, (rainySeasonInArea Angola (RecurrentTimeIntervalFn November April)).
domain: GeographicArea
range: TimeInterval
type: NamedIndividual
type: AsymmetricRelation
type: BinaryPredicate

regionalIssue
type: ObjectProperty
comment: (regionalIssue ?AREA ?ISSUE) means that in the GeographicArea ?AREA, there is a concern with ?ISSUE.
range: AreaOfConcern
domain: GeographicArea
type: NamedIndividual
type: BinaryPredicate

relativeHumidity
type: ObjectProperty
comment: (relativeHumidity ?AREA ?AMOUNT) means that the amount of moisture in the air at ?AREA is ?AMOUNT. Relative humidity expresses the amount of moisture as a percentage, or ratio, between the actual moisture saturation of the air compared to the potential moisture saturation of the air. At full (potential) saturation, precipitation would occur.
range: NonnegativeRealNumber
type: DatatypeProperty
domain: Object
type: NamedIndividual
type: AsymmetricRelation
type: BinaryPredicate

seaSurfaceTemperature
type: ObjectProperty
comment: (seaSurfaceTemperature ?AREA ?TEMP) means that the temperature of the sea surface at ?AREA is ?TEMP. Temperature may be expressed in units of TemperatureMeasure, including CelsiusDegree and FahrenheitDegree, among others.
range: ConstantQuantity
domain: WaterArea
type: NamedIndividual
type: AsymmetricRelation
type: BinaryPredicate

slopeGradient
type: ObjectProperty
comment: (slopeGradient ?AREA ?SLOPE) means that in the LandArea ?AREA there is an incline of ?slope, where ?SLOPE is the percent of vertical rise over horizontal distance. slopeGradient gives an approximate value for nonnegative slope over ?AREA, without regard to orientation. For example, (slopeGradient ?AREA 0.10) means that there is a 10% incline across the area, without specifying the direction in which the land rises or falls. Also see slopeGradientTowardsDirection.
range: NonnegativeRealNumber
type: DatatypeProperty
domain: LandArea
type: NamedIndividual
type: BinaryPredicate

streamOutfall
type: ObjectProperty
comment: (streamOutfall ?WATER ?RIVER) means that the WaterArea ?MOUTH is the outfall of the River ?RIVER.
range: River
domain: WaterArea
sub property of: properPart

surfaceWindDirection
type: ObjectProperty
comment: (surfaceWindDirection ?PLACE ?DIRECTION) means that at ?PLACE the wind is coming from the compass point ?DIRECTION. For example, (surfaceWindDirection SanFranciscoBay Northwest) means that the wind in San Francisco Bay is coming from the Northwest. The wind is within 500 feet of Earth's surface.
range: DirectionalAttribute
domain: Object
type: NamedIndividual
type: BinaryPredicate

surfaceWindSpeed
type: ObjectProperty
comment: (surfaceWindSpeed ?PLACE ?RATE) means that the speed of the surface Wind at the GeographicArea ?PLACE is ?RATE. Wind speed may be expressed in knots (KnotUnitOfSpeed) or as any distance per time unit (using (SpeedFn ?DISTANCE ?TIME)). Surface wind is found at the surface of the planet; everyday wind. Technically, Winds moving through the atmosphere up to an altitude of 500 feet.
domain: Object
range: PhysicalQuantity
sub property of: measure
type: NamedIndividual
type: BinaryPredicate

terrainInArea
type: ObjectProperty
comment: (terrainInArea ?AREA ?ATTRIBUTE) means that the GeographicArea ?AREA is or includes a region with the TerrainAttribute ?ATTRIBUTE.
range: TerrainAttribute
domain: GeographicArea
type: NamedIndividual
type: AsymmetricRelation
type: BinaryPredicate

totalArea
type: ObjectProperty
comment: (totalArea ?REGION ?AMOUNT) means that the total area of ?REGION is the AreaMeasure ?AMOUNT.
range: AreaMeasure
domain: Region
type: NamedIndividual
type: BinaryPredicate

totalCoastline
type: ObjectProperty
comment: (totalCoastline ?AREA ?COASTLENGTH) means that the total length of all boundaries between the GeographicArea ?AREA and the ocean is the LengthMeasure ?COASTLENGTH. The coastline counted may be discontinuous and may even be along different oceans (as in Columbia). A totalCoastline of zero indicates a LandlockedArea. Note that only Ocean coastlines are counted, not any shores with inland waters.
domain: GeographicArea
range: LengthMeasure
type: NamedIndividual
type: BinaryPredicate

totalLandBoundary
type: ObjectProperty
comment: (totalLandBoundary ?REGION ?LENGTH) means that the GeographicArea ?REGION has a total LengthMeasure ?LENGTH of land boundaries between it and other countries. Note that the boundaries included in the total length may be discontinuous, as when interrupted by stretches of Seacoast.
domain: GeographicArea
range: LengthMeasure
type: NamedIndividual
type: BinaryPredicate

unratifiedSignatoryToAgreement
type: ObjectProperty
comment: (unratifiedSignatoryToAgreement ?AGENT ?PROP) means that the Agent ?AGENT has signed a document to begin the process of committing to the Agreement ?PROP, but that a ratification process required to complete the commitment has not yet occurred.
domain: Agent
range: Proposition
type: NamedIndividual
type: BinaryPredicate

vegetationType
type: ObjectProperty
comment: (vegetationType ?AREA ?TYPE) means that in the %GeographicArea ?AREA, one can find Plants of type ?TYPE.
domain: GeographicArea
range: Plant
type: NamedIndividual
type: AsymmetricRelation
type: BinaryRelation

warmSeasonInArea
type: ObjectProperty
comment: (warmSeasonInArea ?AREA ?INTERVAL) means that in the GeographicArea ?AREA, the warm season occurs during the TimeInterval ?INTERVAL.
domain: GeographicArea
range: TimeInterval
type: NamedIndividual
type: AsymmetricRelation
type: BinaryPredicate

waterAreaOnly
type: ObjectProperty
comment: (waterAreaOnly ?REGION ?MEASURE) means that the total area(s) of surface water within the GeographicArea ?REGION has the AreaMeasure ?AMOUNT. The pieces of water need not be continuous within the region. See WaterOnlyArea.
range: AreaMeasure
domain: GeographicArea
type: NamedIndividual
type: BinaryPredicate

windRelativePosition
type: ObjectProperty
comment: (windRelativePosition ?OBJECT ?POSITION) means that the Wind blows at ?OBJECT from the relative vector ?POSITION. E.g., Crosswind, Headwind, Tailwind.
range: Attribute
domain: Object
type: NamedIndividual
type: AsymmetricRelation
type: BinaryPredicate

DocumentFn
type: ObjectProperty
comment: (DocumentFn ?PROP) denotes a class of Text objects that contain the information ?PROP.
domain: Proposition
range subclass: Text
type: NamedIndividual
type: UnaryFunction

airTemperature
type: ObjectProperty
comment: (airTemperature ?AREA ?TEMP) means that the temperature of the air at ?AREA is ?TEMP. Temperature may be expressed in units of TemperatureMeasure, including CelsiusDegree and FahrenheitDegree, among others.
range: ConstantQuantity
domain: Object
type: NamedIndividual
type: AsymmetricRelation
type: BinaryPredicate

barometricPressure
type: ObjectProperty
comment: (barometricPressure ?AREA ?PRESSURE) means that the atmospheric pressure measured at ?AREA is ?PRESSURE. Barometric pressure is typically expressed in units of InchMercury or MmMercury. For example, standard sea level pressure is 29.92 inches (760 mm) of mercury: (barometricPressure SeaLevel (MeasureFn 29.92 InchMercury)).
range: PressureMeasure
domain: Object
sub property of: measure
type: NamedIndividual
type: AsymmetricRelation
type: BinaryPredicate

climateTypeInArea
type: ObjectProperty
comment: (climateTypeInArea ?TYPE ?REGION) means that all or part of the GeographicArea ?REGION is of the ClimateZone ?TYPE.
range: ClimateZone
domain: GeographicArea
type: NamedIndividual
type: BinaryPredicate

orbits
type: ObjectProperty
comment: (orbits ?SATELLITE ?FOCUS) means that the Object ?SATELLITE revolves around the AstronomicalBody ?FOCUS.
range: AstronomicalBody
domain: Object
type: NamedIndividual
type: AsymmetricRelation
type: BinaryPredicate

waterDepth
type: ObjectProperty
comment: (waterDepth ?AREA ?HEIGHT) means that the depth of water at the Region ?AREA is the LengthMeasure ?HEIGHT.
range: LengthMeasure
domain: Region
sub property of: height
type: NamedIndividual
type: BinaryPredicate

geographicSubregion
type: ObjectProperty
comment: (geographicSubregion ?PART ?WHOLE) means that the GeographicArea ?PART is part of the GeographicArea ?WHOLE.
domain: GeographicArea
range: GeographicArea
sub property of: located
sub property of: properPart
type: NamedIndividual
type: AsymmetricRelation
type: BinaryPredicate
type: TransitiveRelation

AcidRainfall
type: Class
subclass of: Process
comment: AcidRainfall is the subclass of Raining in which the precipitate contains harmful amounts of sulfur dioxide or nitrogen oxide. The standard for acid rain is below 5.6 pH.
causes subclass: Acidification

Acidification
type: Class
subclass of: Process
comment: Acidification is the process of lowering soil and water pH due to acid rain or other types of acid deposition. Potential harmful effects include killing freshwater fish and plants.

AerosolParticulate
type: Class
subclass of: Pollutant
comment: AerosolParticulate is a subclass of Pollutant that includes aerosol-dispersed particles that are mixed with air, gas, or smoke.

Afforestation
type: Class
subclass of: Planting
comment: Afforestation is the process of planting trees and plants on spaces that are either empty or in agricultural use.

Aftershock
type: Class
subclass of: EarthTremor
comment: Aftershock is the subclass of EarthTremors that occur after the main tremor(s) of an Earthquake.

Agreement
type: Class
subclass of: Proposition
comment: Agreement is the class of Propositions that express the contents of agreements entered into by CognitiveAgents. Agreement includes treaties, contracts, purchase orders, pledges, marriage vows, etc. An Agreement may be written down in a document or other ContentBearingObject.

AirPollution
type: Class
subclass of: PollutionProcess
comment: AirPollution is the subclass of PollutionProcesses in which air is contaminated.
causes subclass: AcidRainfall

ArableLand
type: Class
subclass of: LandArea
comment: ArableLand is the subclass of LandArea that represents land in cultivation with crops that are replanted after each harvest, e.g., wheat and rice.

ArcMinute
type: Class
subclass of: PlaneAngleMeasure
comment: ArcMinute represents a UnitOfMeasure equivalent to 1/60th of an AngularDegree.
type: NamedIndividual
type: UnitOfMeasure

ArcSecond
type: Class
subclass of: PlaneAngleMeasure
comment: ArcSecond represents a UnitOfMeasure equivalent to 1/60th of an ArcMinute.
type: NamedIndividual
type: UnitOfMeasure

ArchipelagicArea
type: Class
subclass of: GeographicArea
comment: ArchipelagicArea is a subclass of GeographicAreas that include an Archipelago and the surrounding WaterArea.

Archipelago
type: Class
subclass of: LandForm
subclass of: Collection
comment: Archipelago is a subclass of LandForm that consists of groups of islands lying together.

Asbestos
type: Class
subclass of: Pollutant
subclass of: Mineral
comment: Asbestos is a subclass of Mineral that includes several types of fibrous minerals used in construction and Artifacts for their fire-resistant properties. They are less used since the discovery that they are carcinogenic.

Atoll
type: Class
subclass of: CoralReef
subclass of: IslandGroup
comment: Atoll is the subclass of CoralReefs which surround a lagoon.

AvalancheProcess
type: Class
subclass of: Impelling
comment: AvalancheProcess is a subclass of Motion that represents events in which a loosened mass of snow, ice, rock, or earth rapidly descends a steep slope, with a destructive force.

barite
type: Class
subclass of: CompoundSubstance
subclass of: Mineral
comment: Barite is the class representing Barium Sulfate occurring as a Mineral.

Basin
type: Class
subclass of: LandForm
comment: Basin is the class of LandForms consisting of an area of land enclosed or partially enclosed by higher land.

bauxite
type: Class
subclass of: CompoundSubstance
subclass of: Mineral
comment: Bauxite is the class representing impure mixtures of earthy hydrous aluminum oxides and hydroxides that is the principal source of aluminum.

Bay
type: Class
subclass of: Inlet
comment: Bay is a subclass of Inlets. Bays occur in either salt or fresh water areas. Typically, a bay is smaller than a Gulf.

BeaufortNumber
type: Class
subclass of: UnitOfMeasure
comment: BeaufortNumber is the class of values on the Beaufort Scale for indicating wind force, according to classifications based on observable weather conditions and later related to wind speed ranges.

BiodiversityAttribute
type: Class
subclass of: InternalAttribute
comment: BiodiversityAttribute is the class of Attributes that describe the level of biodiversity present in a GeographicArea or Ecosystem.

Biome
type: Class
subclass of: Ecosystem
comment: Biome is the class of GeographicAreas representing major kinds of ecological communities, that is, areas in which certain kinds of plants, animals, weather, and terrain interact to produce and support a distinctive ecosystem.

brown coal
type: Class
label: lignite
subclass of: coal
comment: BrownCoal is the class representing soft Coals that are harder than peat and softer than bituminous coal. Also called lignite, these are brownish in color.

Butte
type: Class
subclass of: LandForm
subclass of: UplandArea
comment: Butte is the subclass of LandForms consisting of UplandAreas raised sharply from the surrounding region. Buttes are smaller in area than Mesas.

Cape
type: Class
subclass of: LandForm
comment: Cape is a subclass of LandForms that consist of pieces of land that project into a body of water, with the widest portion typically being joined to the mainland.

CarbonCycle
type: Class
subclass of: GeologicalProcess
comment: CarbonCycle is the class of GeologicalProcesses in which carbon in various forms is passed between air, water, earth, and the biosphere.

CarbonDioxideEmission
type: Class
subclass of: Process
comment: CarbonDioxideEmission is the class of processes in which carbon dioxide is emitted.
related internal concept: VehicularPollution

CaveMatrix
type: Class
subclass of: UndergroundArea
subclass of: LandForm
comment: CaveMatrix is the subclass of LandForms that consist of the framework of earth or rock in which a Cave is embedded.

Channel
type: Class
subclass of: BodyOfWater
comment: Channel is a subclass of BodyOfWater that consists of narrow deep waterways connecting two larger bodies of water. Channels may be natural or dredged, and may occur in salt or fresh water. In general, Channels are narrower than Straits.

chromite
type: Class
subclass of: CompoundSubstance
subclass of: Mineral
comment: Chromite is the class representing Minerals that consist of an oxide of iron and chromium.

ClearWeather
type: Class
subclass of: WeatherProcess
comment: ClearWeather represents a condition in which less than 30% of the sky is covered with clouds.

Cliff
type: Class
subclass of: slope
comment: Cliff is the subclass of LandForms consisting of high, very-steep-to-perpendicular or overhanging faces of rock or earth.

CoastalPlain
type: Class
subclass of: Plain
comment: CoastalPlain is the class of broad plains areas adjacent to a Sea or Ocean. A coastal plain includes a narrower ShoreArea adjacent to a body of water.

ColdFront
type: Class
subclass of: WeatherFront
comment: ColdFront is the class of transitional weather processes occurring between a cold air mass that is advancing upon a warm air mass.

ContinentalMargin
type: Class
subclass of: SubmergedLandArea
comment: ContinentalMargin is the class of SubmergedLandAreas that are the extension of land underwater at the edge of a continent, before a drop to the sea floor. A ContinentalMargin includes the ContinentalShelf and the continental break, slope, or rise found at the outer edge.

ContinentalShelf
type: Class
subclass of: SubmergedLandArea
comment: ContinentalShelf is the class of a natural undersea extensions of land around a Continent. The shelf is a gently sloped (average less than one percent) plain that is an extension of the CoastalPlain found off the coast of most continents.

CoralReef
type: Class
subclass of: Reef
comment: CoralReef is the subclass of Reefs that are formed from living organisms that produce the limestone formations of the reef. Coral reefs include fringing reefs, barrier reefs, and Atolls.

Cove
type: Class
subclass of: Inlet
comment: Cove is a subclass of small Inlets.

CyclonicStorm
type: Class
subclass of: LowPressureWeatherSystem
comment: CyclonicStorm is the class of LowPressureWeatherSystems that involve a low pressure area surrounded by rapidly rotating winds, with the whole system typically moving forward at 20-30 mph.

dichoro-diphenyl-trichloro-ethane
type: Class
subclass of: CompoundSubstance
comment: DDT (dichoro-diphenyl-trichloro-ethane) is a highly toxic insecticide also harmful to most other animal species. DDT was banned in the UnitedStates in 1972.

Defoliant
type: Class
subclass of: Herbicide
comment: Defoliant is the class of Herbicides that are used to make plants lose their leaves prematurely. Defoliants are used both in agriculture and warfare.

Deforestation
type: Class
subclass of: Removing
comment: Deforestation is the class of events in which BotanicalTrees and even whole Forests are removed from some GeographicArea.

Delta
type: Class
subclass of: LandForm
comment: Delta is the subclass of LandForms that are composed of Silt or other alluvium, deposited at or near the mouth of a River or stream where it enters a body of relatively static water. Typical Deltas are flat and fan-shaped.

Desert
type: Class
subclass of: LandArea
comment: Desert is a subclass of LandAreas that are arid regions having sparse or no vegetation.

Desertification
type: Class
subclass of: Process
comment: Desertification represents the subclass of climate Processes by which desert conditions are spread over a GeographicArea.

Dredging
type: Class
subclass of: Removing
comment: Dredging is the subclass of Removing processes in which dirt, sand, silt, or other accumulated material at the bottom of a WaterArea is collected and removed.

DriftnetFishing
type: Class
subclass of: Fishing
comment: DriftnetFishing is the subclass of Fishing that uses large nets which indiscriminately capture many marine species.

DustStorm
type: Class
subclass of: Transfer
subclass of: WeatherProcess
comment: DustStorm is the subclass of Windstorms in which Winds blow large quantities of dust.

mudslide
type: Class
label: earthflow
label: mudflow
subclass of: LandslideProcess
comment: EarthflowProcess is a subclass of LandslideProcess that represents events in which a loosened mass of soil slides down a slope, due to gravity and saturation.

Ecosystem
type: Class
subclass of: GeographicArea
comment: Ecosystem is a subclass of GeographicAreas considered together with their organisms and environment as a functioning whole.

Effluent
type: Class
subclass of: Object
comment: Effluent is a subclass of Object that generically covers any waste matter that is released into the environment, including sewage and industrial pollutants.

EndangeredSpecies
type: Class
subclass of: Organism
comment: EndangeredSpecies is the subclass of Organism that includes plants and animals that are in danger of extinction from destruction of species members or of the species habitat, or both.

EnvironmentalIssue
type: Class
subclass of: AreaOfConcern
comment: EnvironmentalIssue is the subclass of AreaOfConcern that represents issues related to the environment in some way. The subclasses of EnvironmentalIssue represent broad topics under which environmental issues may be grouped. Individual issues are Attributes that characterize regions where there are events or situations about which this issue or concern arises.

Estuary
type: Class
subclass of: BodyOfWater
subclass of: Inlet
subclass of: SaltWaterArea
comment: Estuary is the subclass of BodyOfWater that represents WaterAreas where a sea or ocean Tide meets a River current.

ExclusiveFishingZone
type: Class
subclass of: MaritimeClaimArea
subclass of: SaltWaterArea
comment: ExclusiveFishingZone is the subclass of MaritimeClaimArea including offshore areas over which a nation claims exclusive jurisdiction only for fishing purposes (cf. MaritimeExclusiveEconomicZone). Zone widths vary up to 200 miles (NM).

ExtendedFishingZone
type: Class
subclass of: MaritimeClaimArea
subclass of: SaltWaterArea
comment: ExtendedFishingZone is the subclass of MaritimeClaimArea that includes offshore areas over which a nation claims fishing rights, beyond that nation's ExclusiveFishingZone. Zone widths vary, from as little as 12 miles (NM) up to a width of 200 miles (NM).

fathom
type: Class
subclass of: LengthMeasure
comment: Fathom is a UnitOfMeasure used for measuring water depth. One fathom is equal to six feet.
type: NamedIndividual
type: UnitOfMeasure

Fire
type: Class
subclass of: Combustion
comment: Fire is the subclass of Combustion events in which flames are present. Fires are slower combustion processes overall than explosions, though some fires may include explosive episodes.

Fluorspar
type: Class
label: Fluorite
subclass of: Mineral
comment: Fluorite or Fluorspar is the class of transparent or translucent minerals consisting of the fluoride of calcium.

ForestFire
type: Class
subclass of: Combustion
comment: ForestFire is the subclass of Fires in which Forests are burned.

FreezingRain
type: Class
subclass of: Precipitation
comment: FreezingRain is a precipitation process in which water falls in a state between Liquid and Solid.

Freshwater
type: Class
subclass of: Water
comment: Freshwater is the subclass of Water that has low soluble mineral content. See also PotableWater.

GeologicalFault
type: Class
subclass of: GeographicArea
comment: GeologicalFault is the subclass of GeographicAreas in which there is a fracture in the Earth's crust and differential movement can occur on the two sides of the fault. Such movement results in EarthTremors and is the cause of Earthquakes.

Glacier
type: Class
subclass of: LandForm
comment: Glacier is the subclass of LandForms that consist of large bodies of slow-moving ice. Glaciers displace soil and rock while moving over land surfaces and break apart when they reach the sea, forming Icebergs.

Graphite
type: Class
subclass of: Carbon
comment: Graphite is a soft black form of Carbon.

GrassFire
type: Class
subclass of: Combustion
comment: GrassFire is the subclass of Fires in which Grasslands are burned.

Grassland
type: Class
subclass of: Biome
subclass of: LandArea
comment: Grassland is the class of LandAreas where the predominant vegetation is some kind of grass.

Gravel
type: Class
subclass of: Rock
comment: Gravel is the subclass of Rock consisting of small rounded stones, often mixed with sand. The construction trades classify different types of gravel by size.

GreenhouseGas
type: Class
subclass of: PureSubstance
comment: GreenhouseGas is the subclass of substances that, when present in the atmosphere, trap infrared radiation and cause global warming. Greenhouse gases include carbon dioxide, hydrofluorocarbons, methane, nitrous oxide, ozone, and water vapor.

Groundwater
type: Class
subclass of: Water
comment: Groundwater is the subclass of Water that is found in deposits in the earth.

Herbicide
type: Class
subclass of: BiologicallyActiveSubstance
comment: Herbicide is the subclass of BiologicallyActiveSubstances, whether naturally occurring or manufactured, that are capable of killing some type of Plant that is considered undesirable by Humans.

HighPressureWeatherSystem
type: Class
subclass of: WeatherSystem
comment: HighPressureWeatherSystem is the class of weather systems characterized by high barometricPressures. High pressure systems typically cause clear weather.

HigherHighTide
type: Class
subclass of: HighTide
comment: HigherHighTide is the subclass of HighTide processes that occur in marine waters with a MixedTideProcess.

Hill
type: Class
subclass of: LandForm
subclass of: UplandArea
comment: Hill is the subclass of LandForms that are raised parts of the earth's surface which have sloping sides. Hills may be the result of Erosion on old mountains, making them shorter and more rounded.

Hurricane
type: Class
subclass of: TropicalCyclone
comment: Hurricane is the subclass of TropicalCyclones having winds at or above 74 MPH, usually accompanied by Thunderstorms, and occurring in the western AtlanticOcean and CaribbeanRegion during summer months.

HydropowerWaterArea
type: Class
subclass of: FlowRegion
subclass of: WaterArea
comment: HydropowerWaterArea is the class of WaterAreas with waterflow strength adequate for the production of hydropower.

Iceberg
type: Class
subclass of: SeaIce
subclass of: Ice
subclass of: SelfConnectedObject
comment: An Iceberg is a large chunk of ice that has broken off from a glacier and fallen into the sea. The larger part of an Iceberg floats underwater.

Icing
type: Class
subclass of: WeatherProcess
comment: Icing is the class of WeatherProcesses in which the ambient temperature drops below the freezing point, and objects in the affected area become coated with Ice.

IndustrialPollution
type: Class
subclass of: PollutionProcess
comment: IndustrialPollution is the subclass of PollutionProcess characterized by pollutants that originate in industrial processes.

InlandWaterSystem
type: Class
subclass of: Collection
subclass of: WaterArea
comment: InlandWaterSystem is a subclass of WaterArea consisting of water systems that comprise two or more Lakes or Rivers, Canals, or other waterways that are interconnected.

InletPassage
type: Class
subclass of: Inlet
comment: InletPassage is the class of water passages connecting an area of open water to a bay or lagoon, through some land barrier(s) close on either side.

Insecticide
type: Class
subclass of: BiologicallyActiveSubstance
comment: Insecticide is the subclass of BiologicallyActiveSubstances, whether naturally occurring or manufactured, that are capable of killing some type of Insect.

InternationalAgreement
type: Class
subclass of: Agreement
comment: InternationalAgreement is the subclass of Agreements which are made by and between Nations.

InternationalBorder
type: Class
subclass of: GeographicArea
comment: InternationalBorder is the subclass of GeographicAreas where the areas of two Nations meet, or where the areas of a Nation and an OverseasArea, or of two OverseasAreas, meet.

iron ore
type: Class
subclass of: Mineral
comment: IronOre is a subclass of Mineral that contains compounds of iron, of which the most common are hematite and limonite. Iron is obtained from smelting iron ores.

IrrigatedLand
type: Class
subclass of: LandArea
comment: IrrigatedLand is the subclass of LandArea representing land whose water supply is artificially supplied or supplemented.

Irrigating
type: Class
subclass of: Translocation
comment: Irrigating is the process of transporting and applying water to crops by artificial means.

IrrigationChannel
type: Class
subclass of: Artifact
comment: IrrigationChannel is the class of artificially created channels used for transporting water to agricultural fields for Irrigating crops.

IslandGroup
type: Class
subclass of: Collection
subclass of: GeographicArea
comment: IslandGroup is a subclass of GeographicArea whose instances are groups of Islands.

Isthmus
type: Class
subclass of: LandForm
comment: Isthmus is a subclass of LandForms consisting of a narrow strip of land that connects two larger land masses and is bordered on two sides by water.

JetStream
type: Class
subclass of: AirStream
comment: JetStream is the class of high-velocity AirStreams that blow constantly in the upper atmosphere with constant speed and direction, though their location shifts somewhat. There are four JetStreams in EarthsAtmosphere.

Jungle
type: Class
subclass of: Biome
subclass of: LandArea
comment: Jungle is a subclass of fertile LandAreas that are overgrown with tropical vegetation.

knot
type: Class
subclass of: ConstantQuantity
comment: KnotUnitOfSpeed is a unit for measuring speed. One KnotUnitOfSpeed is equal to one NauticalMile per one HourDuration.
type: NamedIndividual
type: UnitOfMeasure

Lake
type: Class
subclass of: StaticWaterArea
comment: Lake is the subclass of BodyOfWater whose instances are naturally occurring static bodies of water surrounded by land.

LakeRegion
type: Class
subclass of: GeographicArea
comment: A LakeRegion is a GeographicArea including land surrounding one or more Lakes.

LandSubsidence
type: Class
subclass of: GeologicalProcess
comment: LandSubsidence is the subclass of GeologicalProcesses in which the elevation of a land area becomes lower. Subsidence is attributable to a variety of processes or activities that undermine Earth's crust, including seismic activity, erosion (as of underground limestone deposits), mining, drilling and pumping underground resources including water and oil.

LandlockedArea
type: Class
subclass of: LandArea
comment: LandlockedArea is the class of LandAreas that lack access to an Ocean or to a Waterway providing a link to the ocean.

LandslideProcess
type: Class
subclass of: Impelling
comment: LandslideProcess is a subclass of Motion that represents events in which a loosened mass of mud, dirt, or rock slides down a slope, by the force of gravity and possibly also saturation.

latitude
type: Class
label: parallel
subclass of: Region
comment: Latitude is the class of Regions, associated with areas on the Earth's surface, which are parallels measured in PlaneAngleDegrees from the Equator.

Lichen
type: Class
subclass of: NonFloweringPlant
comment: Lichen is the class of complex thallyphytic plants made up of Alga and Fungus growing symbiotically.

LittoralCurrent
type: Class
subclass of: WaterCurrent
comment: LittoralCurrent is the subclass of WaterCurrents that occur near a ShoreArea. Examples include TidalEbb, TidalFlow, and RipCurrents.

LittoralZone
type: Class
subclass of: GeographicArea
comment: LittoralZone is the subclass of GeographicAreas that are located along the shore of a large body of water, especially an Ocean or Sea, and which include the area extending from the high tide mark out to a depth of 200 meters. The littoral zone is of interest for its land features, e.g., slope gradient and soil composition, including features of its SubmergedLandArea.

Loam
type: Class
subclass of: Soil
comment: Loam is the subclass of Soils that are intermediate in texture between clay and sand, consisting of a mixture of Clay, Sand, Gravel, Silt, and organic matter (Humus).

meridian
type: Class
label: longitude
subclass of: Region
comment: Longitude is the class of Regions, associated with areas on the Earth's surface, which are meridians measured in PlaneAngleDegrees from the PrimeMeridian through GreenwichEnglandUK.

LowPressureWeatherSystem
type: Class
subclass of: WeatherSystem
comment: LowPressureWeatherSystem is the class of weather systems characterized by low or unstable barometricPressures. Low pressure systems typically introduce unsettled weather, frequently including storms.

Magnesite
type: Class
subclass of: CompoundSubstance
comment: Magnesite is a naturally occurring compound of magnesium carbonate.

MaritimeClaimArea
type: Class
subclass of: GeographicArea
comment: A MaritimeClaimArea is a GeographicArea delimited by a geopolitical state's claim, under the LawOfTheSea, of rights to certain resources, activities, or jurisdiction in the claimed area. MaritimeClaimAreas can pertain to WaterAreas, SubmergedLandAreas, and airspace.

MaritimeContiguousZone
type: Class
subclass of: MaritimeClaimArea
subclass of: SaltWaterArea
comment: MaritimeContiguousZone is the subclass of MaritimeClaimArea that includes areas over which a geopolitical state may exercise some control of activities beyond the 12-mile zone of its TerritorialSea. In general, the authorized control is for preventing or punishing activities that would violate laws applying within the 12-mile zone (that is, authorization to chase and intercept). According to the LawOfTheSea, a MaritimeContiguousZone may extend up to 24 nautical miles from the coast.

MaritimeExclusiveEconomicZone
type: Class
subclass of: MaritimeClaimArea
subclass of: SaltWaterArea
comment: MaritimeExclusiveEconomicZone is the subclass of MaritimeClaimArea that represents the offshore area that coastal nations can claim for fishing and other uses of the ocean water and seabed found there.

MaritimeShelfArea
type: Class
subclass of: MaritimeClaimArea
subclass of: SubmergedLandArea
comment: MaritimeShelfArea is a subclass of MaritimeClaimArea that covers SubmergedLandAreas claimed by an adjacent geopolitical area. The LawOfTheSea defines the continental shelf as extending up to 200 miles (NM) offshore and including the resources found therein. The defined claim area does not correspond exactly to a geological ContinentalShelf, but if there is one, the two areas will overlap spatially.

Mesa
type: Class
subclass of: LandForm
subclass of: UplandArea
comment: Mesa is the subclass of LandForms consisting of land formations having a relatively flat top and steep rock walls.

MetallurgicalPlant
type: Class
subclass of: Organization
comment: MetallurgicalPlant is the subclass of Organization that includes metal refining and manufacturing plants. Such plants typically release extremely toxic waste which can pollute air and groundwater if not properly treated.

MixedTideProcess
type: Class
subclass of: TidalProcess
comment: MixedTideProcess is the subclass of TidalProcesses consisting of daily cycles in which the two low and two high tides are of unequal height. In areas with this kind of pattern, the chart (based on average low water) is determined by the Mean Lower Low Water.

Mountain
type: Class
subclass of: LandForm
subclass of: UplandArea
comment: Mountain is the subclass of high, rocky LandForms, usually having steep sides, a pointed or rounded top, and greater height than a Hill.
ground subsurface type: Rock

MountainRange
type: Class
subclass of: LandForm
subclass of: UplandArea
comment: MountainRange is the subclass of LandForms consisting of a row or chain of connected Mountains.

natural gas
type: Class
subclass of: OrganicCompound
comment: NaturalGas is the class representing a combustible gaseous OrganicCompound of methane and higher hydrocarbons.

nautical mile
type: Class
subclass of: LengthMeasure
comment: NauticalMile represents the international unit used for measuring distance in sea and air navigation. The unit is based on the length of a minute of arc of a great circle of PlanetEarth.
type: NamedIndividual
type: UnitOfMeasure

NoxiousSubstance
type: Class
subclass of: Pollutant
comment: NoxiousSubstance is the class of substances that are directly harmful to Humans.

Oasis
type: Class
subclass of: Biome
subclass of: LandArea
comment: Oasis is a subclass of LandAreas that are fertile places within a desert, which have water and some vegetation.

OccludedFront
type: Class
subclass of: WeatherFront
comment: OccludedFront is the class of complex weather transition processes in which a cold air mass overtakes a warm air mass and lifting it.

OceanCurrent
type: Class
subclass of: WaterCurrent
comment: OceanCurrent is the subclass of WaterCurrents that are located in an ocean.

OceanTrench
type: Class
subclass of: SubmergedLandArea
comment: OceanTrench is the subclass of SubmergedLandAreas that are deep valleys on the ocean floor.
related internal concept: Valley

OvercastWeather
type: Class
subclass of: WeatherProcess
comment: OvercastWeather represents a condition in which more than 70% of the sky is covered with clouds.

Overgrazing
type: Class
subclass of: Process
comment: Overgrazing is the class of processes in which grazing animals consume vegetation faster than it can regrow.

pH
type: Class
subclass of: ConstantQuantity
comment: PHValue ('pH') is a UnitOfMeasure used to measure the acidity or alkalinity of a solution. The pH scale ranges from 0 to 14. The pH of a neutral solution is 7. Acid solutions have a pH value less than seven. Alkaline solutions have a value greater than seven.
type: NamedIndividual
type: UnitOfMeasure

Pampa
type: Class
subclass of: Grassland
subclass of: Plain
comment: Pampa is a class of vast, level, typically grassy Plains of land in South America.

PartlyCloudyWeather
type: Class
subclass of: WeatherProcess
comment: PartlyCloudyWeather represents a condition in which between 30% and 70% of the sky is covered with clouds.

PerimeterArea
type: Class
subclass of: Region
comment: A PerimeterArea is a region that extends outward from a boundary with another region, surrounding or partially surrounding it, but which is not part of that other region. See BorderFn and PerimeterAreaFn.

Permafrost
type: Class
subclass of: Soil
subclass of: LandArea
comment: Permafrost is a subclass of LandAreas consisting of permanently frozen Soil.

PermanentCropLand
type: Class
subclass of: LandArea
comment: PermanentCropLand is the subclass of LandArea that represents land cultivated for crops that are produced without replanting after every harvest, such as fruit trees, coffee, rubber, nuts, and vineyards. Does not include timberland. Cf. arableLandArea.

Pesticide
type: Class
subclass of: BiologicallyActiveSubstance
comment: Pesticide is the subclass of BiologicallyActiveSubstances, whether naturally occurring or manufactured, that are capable of killing some type of Animal that is considered undesirable by Humans.

PesticidePollution
type: Class
subclass of: PollutionProcess
comment: PesticidePollution is the subclass of PollutionProcess in which the pollutant is a pesticide.

phosphate
type: Class
subclass of: CompoundSubstance
comment: Phospate is the class representing phosphate, a salt or ester of a phosphoric acid.

Piedmont
type: Class
subclass of: LandArea
comment: Piedmont is the subclass of LandForms that are LandAreas at the foot of Mountains.

Plain
type: Class
subclass of: LandForm
subclass of: LowlandArea
subclass of: LandArea
comment: Plain is the subclass of LandForms consisting of a broad, flat or gently rolling land area, usually (but not necessarily) of low elevation.

Plateau
type: Class
subclass of: LandForm
subclass of: UplandArea
comment: Plateau is the subclass of LandForms consisting of flat upland areas having one steep face. Plateaus are elevated plains.

PoachingToKill
type: Class
subclass of: Hunting
subclass of: Killing
comment: PoachingToKill is the class of illegal Huntings in which non-human Animals are killed, typically for meat, hides, or sport.

Pollutant
type: Class
subclass of: Object
comment: Pollutant is the subclass of Objects that constitute noxious or otherwise destructive materials introduced into air, water, earth, or generally into the natural environment.

PollutionProcess
type: Class
subclass of: Process
comment: PollutionProcess is the subclass of Processes, intentional and non-intentional, involving contamination of a land, water, or air environment.

PotableWater
type: Class
subclass of: Freshwater
comment: PotableWater is the subclass of Water that represents water that is safe to drink.

potash
type: Class
subclass of: CompoundSubstance
comment: Potash is the class representing potash, a potassium carbonate from wood ashes or a potassium compound.

Prairie
type: Class
subclass of: Grassland
subclass of: Plain
comment: Prairie is a class of large plains LandAreas with tall grass vegetation.

PreciousGemstone
type: Class
subclass of: Object
comment: PreciousGemstone is the class of Minerals and fossilized substances that have great monetary value.

PressureMeasure
type: Class
subclass of: ConstantQuantity
comment: PressureMeasure is the class of UnitsOfMeasure used to measure pressure (barometricPressure), e.g., InchMercury.

Pyrite
type: Class
subclass of: CompoundSubstance
subclass of: Mineral
comment: Pyrite is the class of mineral compounds consisting of iron disulfide.

RainForest
type: Class
subclass of: Biome
subclass of: Forest
comment: RainForest is the subclass of LandAreas that are densely planted with trees.

Rapids
type: Class
subclass of: StreamWaterArea
comment: Rapids is the class of WaterAreas that are parts of a StreamWaterArea where the currents move swiftly over rocks.

Reef
type: Class
subclass of: LandForm
comment: Reef is a subclass of LandForms that consist of ridges of rock, coral, or sand at or near the surface of a WaterArea.

Reforestation
type: Class
subclass of: Planting
comment: Reforestation is the process of replanting trees on land where they were cut or burned.

Reservoir
type: Class
subclass of: Artifact
subclass of: FreshWaterArea
comment: Reservoir is the subclass of artifically made (or artifically enlarged) holding areas where water is collected and stored for future use.

ReservoirLake
type: Class
subclass of: Lake
subclass of: Reservoir
comment: ReservoirLake is the subclass of artifically made (or artifically enlarged) bodies of water used for water collection and storage.

Richter scale
type: Class
label: Richter magnitude
subclass of: FunctionQuantity
comment: A RichterMagnitude is a measure of the severity of an EarthTremor. For example, (MeasureFn 6.5 RichterMagnitude) denotes the value of 6.5 on the Richter scale.
type: NamedIndividual
type: UnitOfMeasure

RipCurrent
type: Class
subclass of: LittoralCurrent
comment: A RipCurrent is a fast narrow surface current that flows seaward from a ShoreArea and is very dangerous to swimmers.

RiverBank
type: Class
subclass of: LandForm
subclass of: ShoreArea
comment: RiverBank is the subclass of ShoreAreas that are adjacent to a River.

RiverMouth
type: Class
subclass of: StreamWaterArea
subclass of: WaterArea
comment: RiverMouth is the subclass of WaterAreas that are the outfalls of a river or stream into another body of water.

RiverSystem
type: Class
subclass of: Collection
subclass of: WaterArea
comment: RiverSystem is a subclass of WaterAreas that comprise all the tributary StreamWaterAreas that drain along converging paths into the main River of the system, which in turn discharges into a StaticWaterArea or another, larger River.

RockslideProcess
type: Class
subclass of: LandslideProcess
comment: RockslideProcess is a subclass of LandslideProcess that represents events in which a loosened mass of rock falls or slides from a height, due to gravity.

Salination
type: Class
subclass of: Combining
comment: Salination is the subclass of Combining processes in which salt becomes mixed with either Freshwater or Topsoil. Typically the salt derives either from sea water or from the evaporation of irrigation water.

salt
type: Class
subclass of: CompoundSubstance
comment: Salt is the class representing the crystalline compound sodium chloride.

Sandstorm
type: Class
subclass of: WeatherProcess
comment: Sandstorm is the subclass of Windstorms in which Winds blow large quantities of Sand.

Sanitation
type: Class
subclass of: Removing
comment: Sanitation is the class of Removing processes in which human waste and garbage are disposed of.

Savanna
type: Class
subclass of: Grassland
subclass of: Plain
comment: Savanna is a class of tropical or subtropical Grasslands, typically treeless.

SeaIce
type: Class
subclass of: Ice
comment: SeaIce is the subclass of Ice that consists of ice found at sea, including glaciers, ice floes, and icebergs.

SeabedArea
type: Class
subclass of: SubmergedLandArea
comment: SeabedArea is the class of SubmergedLandAreas that are part of the sea floor.

Seacoast
type: Class
subclass of: LandForm
subclass of: ShoreArea
comment: Seacoast is the subclass of ShoreAreas found along the margin of an Ocean or Sea, extending inland approximately one to three kilometers from the low water mark.

SemipreciousGemstone
type: Class
subclass of: Object
comment: SemipreciousGemstone is the class of Minerals and other substances that have significant monetary value, but less than those of the class PreciousGemstone.

Shoreline
type: Class
subclass of: LandArea
comment: Shoreline is the class of narrow LandAreas that are the edge of a larger land mass abutting a bordering WaterArea.

Silt
type: Class
subclass of: Soil
comment: Silt is the subclass of Soil that consists of Sand or earth which is carried along by flowing water and deposited at a bend in a river or at a river mouth.

Siltation
type: Class
subclass of: Putting
comment: Siltation is the class of processes in which WaterAreas become filled in with silt or mud, due to soil Erosion.

SlashAndBurnAgriculture
type: Class
subclass of: Agriculture
comment: SlashAndBurnAgriculture is the subclass of Agriculture processes in which land is cleared by cutting and burning trees, and crops are farmed until the soil is depleted, at which point the plot is abandoned to regrowth. This rotational technique is viable only with low populations and infrequent re-use.

Sleeting
type: Class
subclass of: Precipitation
comment: Sleeting is a precipitation process in which water falls in a Solid state with small, hard particles.

Snow
type: Class
subclass of: Water
comment: Snow is the subclass of Water consisting of small pieces of frozen water that are condensed from atmospheric water vapor and fall to the ground during Snowing.

SoilDegradation
type: Class
subclass of: Process
comment: SoilDegradation is a class of processes in which the productive capacity of soil is lowered by over-fertilization, overuse of pesticides, erosion, or soil compaction.

SoilErosion
type: Class
subclass of: Erosion
comment: SoilErosion is the subclass of Erosion in which the matter removed by wind or water is topsoil.
causes subclass: Siltation

SoilSalination
type: Class
subclass of: Salination
comment: SoilSalination is the subclass of Salination processes in which Salt is infused into Soil.

SoilSolution
type: Class
subclass of: Solution
comment: SoilSolution is subclass of Solutions that constitute the liquid component of Soil. Soil solutions are largely Water containing a number of Mineral substances in solution, as well as comparatively large amounts of dissolved oxygen and carbon dioxide.

Sound
type: Class
subclass of: BodyOfWater
comment: Sound is the subclass of BodyOfWater consisting of long, relatively narrow waterways that lie along the shore of a land mass and are protected from open water by another land area. Sounds may be protected on the water side by an extension of the mainland or by an island or group of islands. Some sounds open at both ends into the same body of water (e.g., Long Island Sound), while others connect two different bodies of water (e.g., Melville Sound). Sounds may occur in salt or fresh water bodies. In general, Sounds are wider than Straits.

SquareKilometer
type: Class
subclass of: AreaMeasure
comment: SquareKilometer represents a UnitOfMeasure equal to one square kilometer.
type: NamedIndividual
type: UnitOfMeasure

StationaryFront
type: Class
subclass of: WeatherFront
comment: StationaryFront is the class of boundary areas between two air masses that are stationary, with neither mass presently replacing the other.

Steppe
type: Class
subclass of: Plain
comment: Steppe is a subclass of Plain, representing vast, level, treeless areas of land in Asia or SE Europe.

Stone
type: Class
subclass of: Rock
comment: Stone is the class of small fragments of Rock or Mineral matter.

StreamWaterConfluence
type: Class
subclass of: WaterArea
comment: StreamWaterConfluence is the subclass of WaterAreas where a stream or other tributary joins a River.

SubmergedLandArea
type: Class
subclass of: GeographicArea
comment: SubmergedLandArea is the class of land regions that are located beneath bodies of water.

SurfaceGroundArea
type: Class
subclass of: GeographicArea
comment: SurfaceGroundArea is a subclass of GeographicArea that is restricted to regions whose surface is solid ground. A SurfaceGroundArea may be a discontinuous region overlapping a larger, continuous GeographicArea but excluding any WaterAreas enclosed therein. Rivers, lakes, reservoirs and other surface water areas are not part of any SurfaceGroundArea.

SymmetricAttribute
type: Class
subclass of: RelationalAttribute
comment: SymmetricAttribute is the class of RelationalAttributes that hold between two items regardless of their order or orientation.

talc
type: Class
subclass of: Mineral
comment: Talc is the class representing this very soft Mineral that is a basic silicate of magnesium.

TerrainAttribute
type: Class
subclass of: InternalAttribute
comment: TerrainAttribute is a class of Attributes that describe terrain.

TerritorialSea
type: Class
subclass of: MaritimeClaimArea
subclass of: SaltWaterArea
comment: TerritorialSea is the class of contiguous waters over which a GeopoliticalArea claims jurisdiction in accordance with the United Nations Convention on the LawOfTheSea (LOS), Part II. A territorial sea may be up to 12 miles (NauticalMiles) in breadth. A subclass of MaritimeClaimArea.

Thunderstorm
type: Class
subclass of: WeatherProcess
comment: Thunderstorm is the subclass of WeatherProcesses in which a cooling air mass produces strong winds, Precipitation, thunder, and lightning. Some thunderstorms are caused by convention, others by StormFronts.

TidalBore
type: Class
subclass of: LittoralCurrent
comment: A TidalBore is an unusally high, fast tidal inflow from the sea, resulting from a high volume of water rushing from a wide-mouthed bay or Estuary into narrower landward areas.

TidalEbb
type: Class
subclass of: LittoralCurrent
comment: TidalEbb is the subclass of WaterCurrents that are temporary and variable, but regular, currents of ocean water flowing seaward up to and during the time of low tide. Alternating with TidalFlow.

TidalFlow
type: Class
subclass of: LittoralCurrent
comment: TidalFlow is the subclass of WaterCurrents that are temporary and variable, but regular, currents of ocean water flowing landward up to and during the time of high tide. Alternating with TidalEbb.

tsunami
type: Class
label: tidal wave
subclass of: WaterWave
comment: TidalWave is the class of highly destructive ocean waves typically caused by offshore seismic processes.

Tide
type: Class
subclass of: FlowRegion
subclass of: SaltWaterArea
comment: Tide is a vertical movement of the water level in a BodyOfWater due to the gravitational attraction between Earth and the moon and sun. Tides are diurnally recurrent events. In most regions with tides, every day there are two high tides and two low tides. MixedTide represents processes in which the daily tides at either extreme are unequal.

timber
type: Class
subclass of: Wood
comment: Timber is a class representing pieces of Wood that is suitable to use for building or other human purposes.
related internal concept: BotanicalTree
related internal concept: OrganicObject

Tornado
type: Class
subclass of: Windstorm
comment: Tornado is the subclass of Windstorms that consist of rapidly whirling winds moving forward as a funnel-shaped system capable of extreme destruction.

TreatyDocument
type: Class
subclass of: Text
comment: TreatyDocument is the subclass of Texts that represent written agreements between Nations.

TropicalCyclone
type: Class
subclass of: CyclonicStorm
comment: TropicalCyclone is the class of CyclonicStorms that usually occur in the Tropics and typically have rotational winds of hurricane force (74 MPH or higher).

Tundra
type: Class
subclass of: Biome
subclass of: Plain
comment: Tundra is a subclass of flat, treeless Plains areas lying within the ArcticRegion. Subsoil in Tundra is permanently frozen.

Typhoon
type: Class
subclass of: TropicalCyclone
comment: Typhoon is the subclass of TropicalCyclones that occur in or near the East China Sea.

UndergroundArea
type: Class
subclass of: GeographicArea
comment: UndergroundArea is the subclass of GeographicAreas that are located Below the surface of PlanetEarth.

UniformPerimeterArea
type: Class
subclass of: PerimeterArea
comment: UniformPerimeterArea is the subclass of PerimeterAreas that have a defined uniform width.

Valley
type: Class
subclass of: LandForm
subclass of: LowlandArea
comment: Valley is the subclass of LandForms consisting of low-lying land flanked by higher ground. Valleys typically contain a stream or river flowing along the valley floor.

VehicularPollution
type: Class
subclass of: PollutionProcess
comment: VehicularPollution is the subclass of PollutionProcess in which the Pollutants are vehicle emissions.

Veldt
type: Class
subclass of: Grassland
subclass of: Plain
comment: Veldt is a subclass of Grasslands which have scattered shrubs or trees.

VolcanicCone
type: Class
subclass of: Hill
subclass of: Volcano
comment: VolcanicCone is the subclass of LandForms that are Hills of lava or pyroclastic material surrounding a volcanic vent. A VolcanicCone is not as high as a VolcanicMountain.

VolcanicEruption
type: Class
subclass of: GeologicalProcess
comment: VolcanicEruption is the subclass of GeologicalProcesses in which Volcanoes erupt.

VolcanicGasRelease
type: Class
subclass of: VolcanicEruption
comment: VolcanicGasRelease is the subclass of VolcanicEruptions in which massive amounts of hot gases are emitted from a Volcano.

VolcanicMountain
type: Class
subclass of: Mountain
subclass of: Volcano
comment: VolcanicMountain is the subclass of LandForms that are cone-shaped Mountains formed out of rock or ash thrown up from inside the earth by a Volcano. VolcanicMountains typically have an opening or depression in the center at the top.

Volcano
type: Class
subclass of: LandForm
comment: Volcano is the subclass of LandForms that are volcanoes in the broadest sense, i.e., a region containing a vent through which magmous or pyroclastic materials are passed from the interior of PlanetEarth to its surface, in a process of VolcanicEruption. Once delivered to the surface, those materials may form a VolcanicCone or VolcanicMountain. Volcanoes may form above ground (atmospheric) or underwater.

VolcanoStatus
type: Class
subclass of: InternalAttribute
comment: VolcanoStatus is a class of Attributes that describe whether a Volcano is active, dormant, or extinct.

WarmFront
type: Class
subclass of: WeatherFront
comment: WarmFront is the class of transitional weather processes occurring between a warm air mass that is advancing upon a cool air mass.

WaterCatchmentDevice
type: Class
subclass of: Artifact
comment: WaterCatchmentDevice is the subclass of Artifacts used to capture rainwater or runoff as a source of Freshwater.

WaterCurrent
type: Class
subclass of: FlowRegion
subclass of: WaterArea
comment: WaterCurrent is a subclass of FlowRegions consisting of moving water, especially those currents found within a well-identified area and having an established pattern of movement, such as an OceanCurrent, a RipTide, or a River. WaterCurrent is disjoint with StaticWaterArea. As a consequence, Lakes for example cannot be FlowRegions; however, currents may be present in a lake.
disjoint: StaticWaterArea

WaterOnlyArea
type: Class
subclass of: GeographicArea
comment: WaterOnlyArea is a subclass of GeographicArea that is restricted to regions whose surface is water. A WaterOnlyArea may be a discontinuous region overlapping a larger, continuous GeographicArea but excluding any LandAreas enclosed therein. Dry land areas, including islands, are not part of any WaterOnlyArea.

WaterOverutilization
type: Class
subclass of: Process
comment: WaterOverutilization is the subclass of processes in which water resources in an area are depleted due to heavier usage than local sources can supply. One sign of WaterOverutilization is lowering water tables.

WaterPollution
type: Class
subclass of: PollutionProcess
comment: WaterPollution is the subclass of PollutionProcesses in which Water is the polluted substance.

WaterSalination
type: Class
subclass of: Salination
comment: WaterSalination is the subclass of Salination processes in which Salt is infused into Water.

WatershedDivide
type: Class
subclass of: UplandArea
subclass of: LandArea
comment: WatershedDivide is the subclass of LandAreas that are summit areas, that is, narrow tracts of higher ground that constitute the watershed boundary between two adjacent drainage basins. A WatershedDivide divides the surface waters that flow naturally in one direction from those that flow in the opposite direction.

WeatherSeason
type: Class
subclass of: WeatherProcess
comment: WeatherSeason is the class of seasonal processes that are characterized by various weather patterns. WeatherSeasons may recur on a regular annual basis, on a different pattern, or irregularly.

WeatherSystem
type: Class
subclass of: WeatherProcess
comment: WeatherSystem is the class of large-scale atmospheric processes that influence weather in a region for 2-5 days.

Windstorm
type: Class
subclass of: WeatherProcess
subclass of: Wind
comment: Windstorm is the class of WeatherProcesses that involve high-speed Winds occurring without Precipitation.

Agriculture
type: Class
subclass of: Maintaining
comment: Agriculture is a class of Processes in which land, plants, or animals are cultivated in order to produce food or other organic products.

AirStream
type: Class
subclass of: FlowRegion
subclass of: Air
comment: AirStream is the class of FlowRegions that consist of air.

AridClimateZone
type: Class
subclass of: ClimateZone
comment: AridClimateZone is the class of regions in which the climate is characterized by a distinct dry season. Annual rate of moisture evaporation exceeds annual rate of precipitation. This is Class B in the Koeppen climate system.

Atmosphere
type: Class
subclass of: Region
comment: Atmosphere is a class representing the mixtures of gases found surrounding any celestial object that has a gravitational field strong enough to prevent the gases from escaping.

AtmosphericRegion
type: Class
subclass of: GeographicArea
comment: AtmosphericRegion is the class of all subregions of EarthsAtmosphere.

BodyOfWater
type: Class
subclass of: SelfConnectedObject
subclass of: WaterArea
comment: BodyOfWater is the subclass of WaterAreas consisting of a connected body of water with established boundaries marked by either geographical features or conventional borders.

BotanicalTree
type: Class
subclass of: FloweringPlant
comment: BotanicalTree is an imprecise term for a perennial woody plant that is larger than a bush or shrub, generally understood to describe a large growth having one main trunk with few or no branches projecting from its base, a well-developed crown of foliage, and a height at maturity of at least 12 feet.

Canyon
type: Class
subclass of: LandForm
comment: Canyon is the subclass of LandForms that are narrow valleys with steep sides, usually created by water erosion.

Cave
type: Class
subclass of: GeographicArea
subclass of: Hole
comment: Cave is the class of naturally formed openings found beneath the surface of the Earth, openings often formed when limestone or other carbonate bedrock dissolves due to flowing water. Caves may also form by erosion of coastal bedrock, melting of glaciers, or solidification of lava that forms hollow tubes.

Clay
type: Class
subclass of: Soil
comment: Clay is the subclass of fine-grained Soils consisting of Mineral particles, not necessarily clay minerals, that are less than 0.002 mm in their maximum dimension.

ClimateZone
type: Class
subclass of: GeographicArea
comment: ClimateZone is a subclass of GeographicArea in which regions are classified according to their long-term weather conditions. The subclasses of ClimateZone are based on the Koeppen Climate Classification system. In the Koeppen system, climate zones are distinguished based on temperatures and rainfall.

coal
type: Class
subclass of: OrganicCompound
subclass of: Mineral
comment: Coal is the class representing brownish-black or black solid combustible organic substances formed by the decomposition of vegetable matter, under the influence of moisture, pressure, and temperature.

ColdClimateZone
type: Class
subclass of: ClimateZone
comment: ColdClimateZone is the subclass of ClimateZone that is characterized by a warmest month with average temperature less than 10 degrees Celsius and a coldest month with average temperature less than -3 degrees Celsius. This is Koeppen climate system Type D.

ColdDampClimateZone
type: Class
subclass of: ColdClimateZone
comment: ColdDampClimateZone is the subclass of ColdClimateZone that is characterized by having more than 30 mm of precipitation in the driest month. This is subtype 'Df' in the Koeppen climate system.

ContinentalClimateZone
type: Class
subclass of: TemperateClimateZone
comment: ContinentalClimateZone is a subclass of TemperateClimateZone that is characterized by cold winters and hot summers.

Dam
type: Class
subclass of: StationaryArtifact
comment: Dam is the subclass of StationaryArtifacts that are walls built across a stream or river to hold back water.

DesertClimateZone
type: Class
subclass of: AridClimateZone
comment: DesertClimateZone is the class of AridClimateZones characterized by sparse, desert vegetation. Koeppen system 'BW'.

Drought
type: Class
subclass of: WeatherProcess
comment: Drought is the subclass of WeatherProcess that represents long periods without precipitation, which is damaging to crops, livestock, and human life.

DryWinterColdClimateZone
type: Class
subclass of: ColdClimateZone
comment: DryWinterColdClimateZone is a subclass of ColdClimateZone that is characterized by having at least ten times as much precipitation in the wettest summer month as in the driest winter month. This is Koeppen climate system subtype 'Dw'.

EarthTremor
type: Class
subclass of: GeologicalProcess
subclass of: Motion
comment: An EarthTremor is an individual seismic event in which the earth shakes due to release of seismic pressures.
causes subclass: tsunami

temblor
type: Class
label: earthquake
subclass of: GeologicalProcess
comment: Earthquake is the class of events in which the earth shakes while its layers readjust due to tensional stresses in the surface of the earth. A single earthquake may consist of one or more EarthTremors.

Erosion
type: Class
subclass of: GeologicalProcess
subclass of: Removing
comment: Erosion is the subclass of Removing processes in which rock and soil material are removed from LandForms in one area and deposited elsewhere by wind, running water, ice, heat, and other GeologicalProcesses.

Falling
type: Class
subclass of: Translocation
comment: Falling is the class of events in which something moves from a higher location to a lower location under the force of gravity.

Fishing
type: Class
subclass of: Hunting
comment: Fishing is the class of Processes in which Fish are hunted.

Flooding
type: Class
subclass of: Motion
comment: Flooding is the subclass of Motion processes in which the water level of a Waterway rises or water spreads over a flood plain along a Waterway.

FlowRegion
type: Class
subclass of: SelfConnectedObject
comment: FlowRegion is a class of Fluids whose boundaries are relatively stable but whose constitutive material is continuously moving through the region itself and being replaced by other, similar material. Each FlowRegion is constituted by a stream of matter moving as a whole. A FlowRegion may be liquid or gaseous. A wind may be considered as a Process or as a FlowRegion, similarly an OceanCurrent or a WaterWave. The motion process associated with a FlowRegion ?F is denoted by (FlowFn ?F). Note that certain properties belong to the FlowRegion itself (e.g., mass, length, volume, temperature, and speed or velocity of the region moving as a whole), while other properties of interest belong to the Motion of its constitutive stuff (e.g., velocity, direction). The motion of a FlowRegion as a whole (e.g., JetStream moves within the atmosphere) is distinguished from the motion of the pieces of stuff constituting the FlowRegion. See FlowFn and FlowRegionFn.

Forest
type: Class
subclass of: LandArea
comment: Forest is the class of large LandAreas that are covered by trees and associated undergrowth, either growing wild or managed for the purpose of timber production.

Grass
type: Class
subclass of: FloweringPlant
comment: Grass includes any plant of the family Gramineae, a widely distributed group of mostly annual and perennial herbs.

Gulf
type: Class
subclass of: BodyOfWater
subclass of: SaltWaterArea
comment: Gulf is the class of extensions of a Sea or Ocean that reach into a land mass or are partially enclosed by a LandArea. A Gulf is typically larger than a Bay.

Hailing
type: Class
subclass of: Precipitation
comment: Hailing is a precipitation process in which water falls in a Solid state with round, hard pellets.

Hemisphere
type: Class
subclass of: GeographicArea
comment: Hemisphere is the class of GeographicAreas that are halves of the Earth, as traditionally divided into the Northern and Southern Hemispheres along the equator and into the Eastern and Western Hemispheres along a north-south line running 20�W and 160�E.

HighTide
type: Class
subclass of: TidalProcess
comment: HighTide is the class of TidalProcesses that occur twice a day in marine waters, in which the water level rises above the mean sea level.

Humus
type: Class
subclass of: Mixture
comment: Humus is the subclass of decaying organic matter found in Soil and derived from dead animal and plant material.

Hunting
type: Class
subclass of: IntentionalProcess
comment: Hunting is the class of Processes in which an animal or animals are pursued and sometimes captured.

InchMercury
type: Class
subclass of: PressureMeasure
comment: InchMercury is a UnitOfMeasure for barometricPressure. It is used to express the number of inches of mercury supported in a mercurial barometer by the surrounding air pressure.
type: NamedIndividual
type: UnitOfMeasure

Inlet
type: Class
subclass of: BodyOfWater
comment: Inlet is the class of bays or other recesses into the shore of a lake, sea, or river. Inlet includes InletPassages, which are passages leading from open water through some barrier to a Bay or Lagoon.

LandForm
type: Class
subclass of: LandArea
comment: LandForm is the class of geographical or geological types of LandAreas occurring on or within the crust of the planet, such as mountains, caves, hills, plains, valleys, deltas, and including features in SubmergedLandAreas such as the ocean floor.

LandlockedWater
type: Class
subclass of: BodyOfWater
comment: LandlockedWater includes water areas that are surrounded by land, including salt lakes, fresh water lakes, ponds, reservoirs, and (more or less) wetlands.

LowTide
type: Class
subclass of: TidalProcess
comment: LowTide is the class of TidalProcesses that occur twice a day in marine waters, in which the water level falls below the mean sea level.
comment: LowerLowTide is the subclass of LowTide processes that occur in marine waters with a MixedTideProcess.

LowlandArea
type: Class
subclass of: LandForm
comment: LowlandArea is the subclass of LandForms consisting of LandAreas that are lower than their surrounding regions, and which are usually more or less flat terrain.

MediterraneanClimateZone
type: Class
subclass of: TemperateClimateZone
comment: MediterraneanClimateZone is a subclass of TemperateClimateZone that is characterized by mild, cool, wet winters and warm dry summers. Mediterranean shores are the archetype, but the Mediterranean climate is also found elsewhere.

MiddleLatitudeDesertClimateZone
type: Class
subclass of: DesertClimateZone
comment: MiddleLatitudeDesertClimateZone is the subclass of DesertClimateZone characterized by a cool dry climate typical of middle latitude deserts. This is subtype 'BWk' in the Keoppen climate system.

MidlatitudeContinentalClimateZone
type: Class
subclass of: ClimateZone
comment: MidlatitudeContinentalClimateZone is a subclass of TemperateClimateZone that is characterized by cool winters and hot summers.

MmMercury
type: Class
subclass of: PressureMeasure
comment: MmMercury is a UnitOfMeasure for barometricPressure. It is used to express the number of millimeters of mercury supported in a mercurial barometer by the surrounding air pressure.
type: NamedIndividual
type: UnitOfMeasure

MonsoonClimateZone
type: Class
subclass of: TropicalClimateZone
comment: MonsoonClimateZone is the class of TropicalClimateZones in which there is a short dry season between rains heavy enough to keep the ground wet all through the year. This is Koeppen climate system subtype 'Aw'.

Moon
type: Class
subclass of: NaturalSatellite
comment: Moon is the class of NaturalSatellites that orbit planets or large asteroids.

NaturalSatellite
type: Class
subclass of: Satellite
subclass of: AstronomicalBody
comment: NaturalSatellite is the class of large, naturally occurring astronomical bodies orbiting some other AstronomicalBody.
disjoint: Artifact

Ocean
type: Class
subclass of: BodyOfWater
subclass of: SaltWaterArea
comment: Ocean is the class containing the oceans that are the major subdivisions of the WorldOcean. According to the International Hydrographic Association, there are five oceans: the AtlanticOcean, PacificOcean, IndianOcean, SouthernOcean, and ArcticOcean. Note: The largest oceans, the Atlantic and Pacific, are subdivided into Northern and Southern regions, but those regions are not separate Oceans.

Peninsula
type: Class
subclass of: LandForm
comment: Peninsula is a subclass of LandForm consisting of pieces of land that extend into a BodyOfWater and are surrounded on three sides by water. Typically Peninsulas are connected to the mainland by an Isthmus or neck of land that is narrower than the main portion of the peninsula (in contrast to Capes).

crude oil
type: Class
label: petroleum
subclass of: OrganicCompound
comment: Petroleum is the class representing the oily flammable bituminous liquid, also known as 'crude oil'.

Planet
type: Class
subclass of: NaturalSatellite
comment: Planet is the class of large NaturalSatellites that revolve around a star.

Planting
type: Class
subclass of: Putting
comment: Planting is the class of processes in which botanical Plants are planted or transplanted, whether as seeds, seedlings, or mature plants.

PolarClimateZone
type: Class
subclass of: ClimateZone
comment: PolarClimateZone is a subclass of ClimateZone characterized by having an average temperature less than 10 degrees Celsius in the warmest month. This is Koeppen climate system Type E. No agriculture is supported in polar climates.

PolarTypeFClimateZone
type: Class
subclass of: PolarClimateZone
comment: PolarTypeFClimateZone is a subclass of PolarClimateZone characterized by having no month in which the temperature rises to 10 degrees Celsius or above.

RadiatingUltraviolet
type: Class
subclass of: Radiating
comment: RadiatingUltraviolet is the subclass of Radiating processes in which ultraviolet radiation is transmitted or absorbed.

Raining
type: Class
subclass of: Precipitation
comment: Raining is a precipitation process in which water falls in a Liquid state.

River
type: Class
subclass of: BodyOfWater
subclass of: FreshWaterArea
subclass of: StreamWaterArea
comment: River is the subclass of BodyOfWater consisting of large streams of fresh water flowing through a LandArea into a Lake, Ocean, or other body of water.

Rock
type: Class
subclass of: Substance
comment: Rock is the subclass of Substances that are naturally formed aggregates of one or more Minerals, consolidated or not, with some degree of mineralogic and chemical constancy; in popular use the term is usually restricted to those aggregates that are hard, compact, and coherent.

SaltLake
type: Class
subclass of: LandlockedWater
subclass of: SaltWaterArea
comment: SaltLake is the class of landlocked bodies of salt water, including those referred to as 'Seas', e.g., the CaspianSea. But note that the MediterraneanSea is a Sea.

Sand
type: Class
subclass of: Soil
comment: Sand is the subclass of Soils consisting of loose fragments of minerals or rocks. Particles of Sand are smaller than gravel and larger than silt or clay, ranging from 8/10,000 to 8/100 inch (0.02 to 2 millimeters) in diameter. Sand is formed by the Erosion of rocks through the action of water, ice, or air.

Satellite
type: Class
subclass of: AstronomicalBody
comment: Satellite is the collection of bodies that revolve around some astronomical body, e.g., planets around a star. This class includes both artificial and NaturalSatellites.

Sea
type: Class
subclass of: BodyOfWater
subclass of: SaltWaterArea
comment: Sea is the class of smaller subdivisions of the WorldOcean, typically partially surrounded by land. However, for inland salt water bodies that are sometimes called 'Sea', see SaltLake.

Shrub
type: Class
subclass of: FloweringPlant
comment: Shrub is the class of low, perennial, typically multi-stemmed woody plants, called shrubs or bushes.

SigningADocument
type: Class
subclass of: Committing
comment: SigningADocument is the class of actions in which an agent affixes a signature, stamp, or other evidence of authorization or attestation to a document. The document and signature may be electronic. Signings count as SocialInteractions even if done in private, because their significance derives from a social context.

slope
type: Class
subclass of: LandForm
comment: SlopedArea is the subclass of LandForms consisting of land surfaces that lie at an angle to the horizontal so that some points on them are higher than others.

Snowing
type: Class
subclass of: Precipitation
comment: Snowing is a precipitation process in which water falls in a Solid state with light, granular particles.

Soil
type: Class
subclass of: Mixture
comment: Soil is the subclass of Mixtures that are composed of fine rock material disintegrated by geological processes, mixed with Humus, the organic remains of decomposed vegetation.

SolarSystem
type: Class
subclass of: Collection
comment: SolarSystem is the class of systems that consist of a star or stars and any encircling astronomical bodies.

SquareMeter
type: Class
subclass of: AreaMeasure
comment: SquareMeter represents a UnitOfMeasure equal to one square Meter.
type: NamedIndividual
type: UnitOfMeasure

Star
type: Class
subclass of: AstronomicalBody
comment: Star is the class of hot gaseous astronomical bodies.

SteppeClimateZone
type: Class
subclass of: AridClimateZone
comment: SteppeClimateZone is the class of AridClimateZones where the dominant vegetation type is grasses, with no trees. Koeppen system 'BS'.

Strait
type: Class
subclass of: BodyOfWater
comment: Strait is the subclass of BodyOfWater that consists of narrow water areas connecting two larger bodies of water. Straits are naturally occurring bodies of water. Cf. Channel.

SubtropicalDesertClimateZone
type: Class
subclass of: DesertClimateZone
comment: SubtropicalDesertClimateZone is a subclass of DesertClimateZone that is characterized by an average temperature greater than 18 degrees Celsius, as well as very low rainfall. This is Koeppen system 'BWh'.

Swamp
type: Class
subclass of: LandArea
comment: Swamp is a subclass of LandAreas that are inundated with water. Swamps are low, wet land with grasses and possibly trees as vegetation.

TemperateClimateZone
type: Class
subclass of: ClimateZone
comment: TemperateClimateZone is the subclass of ClimateZone whose warmest month has an average temperature greater than 10 degrees Celsius and whose coolest month has an average temperature between 18 degrees and -3 degrees Celsius. This is Class C in the Koeppen climate system.

TemperateSummerDryClimateZone
type: Class
subclass of: TemperateClimateZone
comment: TemperateSummerDryClimateZone is the subclass of TemperateClimateZone that is characterized by dry summers, and in which the wettest winter month has at least three times the moisture of the driest summer month. The driest month has less than an average of 30 mm of precipitation. Koeppen climate system type 'Cs'.

TemperateWinterDryClimateZone
type: Class
subclass of: TemperateClimateZone
comment: TemperateWinterDryClimateZone is a subclass of TemperateClimateZone characterized by having at least 10 times as much precipitation in the wettest summer month as in the driest winter month. Koeppen climate system type 'Cw'.

TidalProcess
type: Class
subclass of: InternalChange
comment: TidalProcess is the class of daily recurring events in which the water level in a BodyOfWater rises and falls with the changing position between Earth and the Moon.

TropicalClimateZone
type: Class
subclass of: ClimateZone
comment: TropicalClimateZone is a subclass of ClimateZone in which the average temperature of the coldest month is greater than 18 degrees Celsius. This is Class 'A' in the Koeppen climate classification system.

TundraClimateZone
type: Class
subclass of: PolarClimateZone
comment: TundraClimateZone is a subclass of PolarClimateZone characterized by having an average temperature above zero degrees Celsius (but below 10 degrees) in the warmest month. Koeppen subtype 'ET'.

UplandArea
type: Class
subclass of: LandForm
comment: UplandArea is the subclass of LandForms consisting of LandAreas that are elevated above their surrounding terrain.

WaterWave
type: Class
subclass of: FlowRegion
subclass of: Water
comment: WaterWave is the class of FlowRegions consisting of a raised ridge of water moving along the surface of a body of water. The WaterWave moves in a direction approximately transverse to the crest line of the wave. The wave is constituted of successive regions of water, which do not travel in the direction of the wave or with it.

Waterfall
type: Class
subclass of: StreamWaterArea
comment: Waterfall is the subclass of StreamWaterAreas where running water falls steeply downhill.

WeatherFront
type: Class
subclass of: WeatherProcess
comment: WeatherFront is the class of weather processes that are involve relationships between two air masses, such as a high pressure weather system or a low pressure system.

WetTropicalClimateZone
type: Class
subclass of: TropicalClimateZone
comment: WetTropicalClimateZone is the subclass of TropicalClimateZone that is characterized by having no dry months. At least 60 mm of rainfall occur in the driest month. This is subtype 'Af' in the Koeppen climate system.

Air
type: Class
subclass of: Mixture
comment: Air is the class of pieces of gaseous matter that make up the atmosphere surrounding Earth.

GeologicalProcess
type: Class
subclass of: InternalChange
subclass of: Motion
comment: The class of activities that are caused by geological forces and affect geological features, and which may affect the biosphere as well.

Precipitation
type: Class
subclass of: Falling
subclass of: WeatherProcess
comment: Precipitation is the process of water molecules falling from the air to the ground, in either a liquid or frozen state.

ShoreArea
type: Class
subclass of: LandArea
comment: ShoreArea is a subclass of LandAreas that are approximately 1-3 km wide bordering a body of water, such as an ocean, bay, river, or lake. A ShoreArea may include within it a variety of LandForms, such as dunes, sloughs, and marshes.

WeatherProcess
type: Class
subclass of: InternalChange
comment: WeatherProcess is the broadest class of processes that involve weather, including seasons, weather systems, and short-term weather events.

Wind
type: Class
subclass of: AirStream
comment: Wind is the class of variable AirStreams that occur in EarthsAtmosphere.

Africa
type: NamedIndividual
type: Continent
geographic subregion: EasternHemisphere
overlaps spatially: NorthernHemisphere
overlaps spatially: SouthernHemisphere

Protocol to the 1979 Convention on Long-Range Transboundary Air Pollution Concerning the Control of Emissions of Nitrogen Oxides or Their Transboundary Fluxes
type: NamedIndividual
type: Agreement

Protocol to the 1979 Convention on Long-Range Transboundary Air Pollution on Persistent Organic Pollutants
type: NamedIndividual
type: Agreement

Protocol to the 1979 Convention on Long-Range Transboundary Air Pollution on the Reduction of Sulphur Emissions or Their Transboundary Fluxes by at least 30%
type: NamedIndividual
type: Agreement

Protocol to the 1979 Convention on Long-Range Transboundary Air Pollution on Further Reduction of Sulphur Emissions
type: NamedIndividual
type: Agreement

Protocol to the 1979 Convention on Long-Range Transboundary Air Pollution Concerning the Control of Emissions of Volatile Organic Compounds or Their Transboundary Fluxes
type: NamedIndividual
type: Agreement

Convention on Long-Range Transboundary Air Pollution
type: NamedIndividual
type: Agreement
label: Air Pollution

Protocol on Environmental Protection to the Antarctic Treaty
type: NamedIndividual
type: Agreement

Antarctic-Marine Living Resources
type: NamedIndividual
type: Agreement
label: Convention on the Conservation of Antarctic Marine Living Resources

AntarcticCircumpolarCurrent
type: NamedIndividual
type: OceanCurrent
comment: AntarcticCircumpolarCurrent represents the AntarcticCircumpolarCurrent, the major OceanCurrent of the SouthernOcean.
located: Southern Ocean

Antarctic Seals
type: NamedIndividual
type: Agreement
label: Convention for the Conservation of Antarctic Seals

Antarctic Treaty
type: NamedIndividual
type: Agreement
comment: The AntarcticTreaty has the following consultative (voting) members: (claimants) Argentina, Australia, Chile, France, NewZealand, Norway, UnitedKingdomOfGreatBritainAndNorthernIreland; (nonclaimants) Belgium, Brazil, Bulgaria, China, Ecuador, Finland, Germany, India, Italy, Japan, SouthKorea, Netherlands, Peru, Poland, Russia, SouthAfrica, Spain, Sweden, Uruguay, UnitedStates. The AntarcticTreaty includes under the treaty all land and ice shelves south of 60 degrees, 00 minutes South and reserves high seas rights.

Antarctica
type: NamedIndividual
type: Continent
geographic subregion: AntarcticRegion
overlaps spatially: EasternHemisphere
geographic subregion: SouthernHemisphere
overlaps spatially: WesternHemisphere

Aral Sea
type: NamedIndividual
type: SaltLake

ArcticOcean
type: NamedIndividual
type: Ocean
comment: ArcticOcean represents the Arctic Ocean.
overlaps spatially: Arctic
partly located: EasternHemisphere
geographic subregion: NorthernHemisphere
partly located: WesternHemisphere

Asia
type: NamedIndividual
type: Continent
geographic subregion: EasternHemisphere
overlaps spatially: NorthernHemisphere
overlaps spatially: SouthernHemisphere

Convention on Biological Diversity
type: NamedIndividual
type: Agreement

CanopiedVegetation
type: NamedIndividual
type: Attribute
comment: CanopiedVegetation describes the density of vegetation in a RainForest or Jungle.

Caribbean Region
type: NamedIndividual
type: GeographicArea
label: Caribbean
comment: CaribbeanRegion represents the land and water GeographicAreas of the CaribbeanSea area.
overlaps spatially: NorthAmerica
geographic subregion: NorthernHemisphere
overlaps spatially: SouthAmerica
geographic subregion: WesternHemisphere

Caspian Sea
type: NamedIndividual
type: SaltLake

Central Africa
type: NamedIndividual
type: GeographicArea
comment: CentralAfrica represents the central GeographicArea of the Continent of Africa.
geographic subregion: Africa
geographic subregion: EasternHemisphere
overlaps spatially: NorthernHemisphere
overlaps spatially: SouthernHemisphere

Central Asia
type: NamedIndividual
type: GeographicArea
comment: CentralAsia represents the central GeographicArea of the Continent of Asia.
geographic subregion: Asia
geographic subregion: EasternHemisphere
geographic subregion: NorthernHemisphere

Central Europe
type: NamedIndividual
type: GeographicArea
comment: CentralEurope represents the central GeographicArea of the Continent of Europe.
geographic subregion: EasternHemisphere
geographic subregion: Europe
geographic subregion: NorthernHemisphere

Central South America
type: NamedIndividual
type: GeographicArea
comment: CentralSouthAmerica represents the central GeographicArea of the Continent of SouthAmerica.
geographic subregion: SouthAmerica
geographic subregion: SouthernHemisphere
geographic subregion: WesternHemisphere

Kyoto Protocol to the United Nations Framework Convention on Climate Change
type: NamedIndividual
type: Agreement
label: Climate Change Kyoto Protocol
label: Kyoto Protocol

United Nations Framework Convention on Climate Change
type: NamedIndividual
type: Agreement
label: Climate Change

Crosswind
type: NamedIndividual
type: Attribute
comment: Crosswind is the relative attribute of a Wind to an object when the force of the wind is applied to a lateral side of the object.

Dead Sea
type: NamedIndividual
type: SaltLake

DenseVegetation
type: NamedIndividual
type: Attribute
comment: DenseVegetation describes the density of vegetation in a Forest.

United Nations Convention to Combat Desertification in those Countries Experiencing Serious Drought or Desertification, Particularly in Africa
type: NamedIndividual
type: Agreement
label: Desertification

Downhill
type: NamedIndividual
type: PositionalAttribute
comment: Downhill is a PositionalAttribute that describes the relation between two things, one of which is located down a slope from the other.

Downstream
type: NamedIndividual
type: PositionalAttribute
comment: Downstream is a PositionalAttribute that describes the orientation of being in the area or direction toward which a Fluid is flowing.

Downwind
type: NamedIndividual
type: PositionalAttribute
comment: Downwind is a PositionalAttribute that indicates relative position downwind (leeward) with respect to the direction that the Wind is blowing.
sub attribute: Downstream

Eastern Africa
type: NamedIndividual
type: GeographicArea
comment: EasternAfrica represents the eastern GeographicArea of the Continent of Africa.
geographic subregion: Africa
geographic subregion: EasternHemisphere
overlaps spatially: NorthernHemisphere
overlaps spatially: SouthernHemisphere

Eastern Asia
type: NamedIndividual
type: GeographicArea
comment: EasternAsia represents the eastern GeographicArea of the Continent of Asia.
geographic subregion: Asia
geographic subregion: EasternHemisphere
geographic subregion: NorthernHemisphere

Eastern Europe
type: NamedIndividual
type: GeographicArea
comment: EasternEurope represents the eastern GeographicArea of the Continent of Europe.
geographic subregion: EasternHemisphere
geographic subregion: Europe
geographic subregion: NorthernHemisphere

Eastern South America
type: NamedIndividual
type: GeographicArea
comment: EasternSouthAmerica represents the eastern GeographicArea of the Continent of SouthAmerica.
overlaps spatially: NorthernHemisphere
geographic subregion: SouthAmerica
overlaps spatially: SouthernHemisphere
geographic subregion: WesternHemisphere

Convention on the International Trade in Endangered Species of Wild Flora and Fauna
type: NamedIndividual
type: Agreement
label: EndangeredSpecies

Environmental Modification
type: NamedIndividual
type: Agreement
label: Convention on the Prohibition of Military or Any Other Hostile Use of Environmental Modification Techniques

Equator
type: NamedIndividual
type: latitude
comment: The Equator is the latitude line encircling PlanetEarth midway between the geographical NorthPole and SouthPole. It is designated as zero degrees Latitude.

FertileTerrain
type: NamedIndividual
type: TerrainAttribute
comment: FertileTerrain is a TerrainAttribute that describes an area that has the type of soil and climate conditions needed to produce good quality crops.

FlatTerrain
type: NamedIndividual
type: TerrainAttribute
comment: FlatTerrain is a TerrainAttribute describing regions within which there is very little variation in elevation.

GeologicallyStable
type: NamedIndividual
type: TerrainAttribute
comment: GeologicallyStable is a TerrainAttribute of a GeographicArea in which the geological substructure is stable, i.e., there are no active Volcanoes, no major fault lines, no blasting or other destabilizing activity.
opposite attribute: GeologicallyUnstable

GeologicallyUnstable
type: NamedIndividual
type: TerrainAttribute
comment: GeologicallyUnstable is a TerrainAttribute of a GeographicArea in which the geological substructure is unstable, e.g., there are active Volcanoes, major fault lines, blasting or other destabilizing activity.

Great Salt Lake
type: NamedIndividual
type: SaltLake
geographic subregion: UnitedStates

GroundCoverVegetation
type: NamedIndividual
type: Attribute
comment: GroundCoverVegetation describes the density of uniform low vegetation in a field or meadow.

Gulf of Aden
type: NamedIndividual
type: Gulf
type: SaltWaterArea
connected: ArabianSea

Gulf of Oman
type: NamedIndividual
type: Gulf
type: SaltWaterArea
connected: ArabianSea

Basel Convention
type: NamedIndividual
type: Agreement
label: Hazardous Wastes
label: Basel Convention on the Control of Transboundary Movements of Hazardous Wastes and Their Disposal

Headwind
type: NamedIndividual
type: Attribute
comment: Headwind is the relative attribute of a Wind to an object when the force of the wind is applied to the front of the object (FrontFn). A headwind can negatively affect the speed capability of a vehicle.

Indian Ocean
type: NamedIndividual
type: Ocean
label: Arctic Ocean
comment: IndianOcean represents the Indian Ocean.
connected: Persian Gulf
connected: South Pacific Ocean
connected: Southern Ocean

IslandOfGreatBritain
type: NamedIndividual
type: Island
comment: IslandOfGreatBritain is the large island lying west of mainland Europe, and which constitutes the largest geographic area of the UnitedKingdomOfGreatBritainAndNorthernIreland.
geographic subregion: Western Europe

IslandOfIreland
type: NamedIndividual
type: Island
comment: IslandOfIreland is the large island lying west of Great Britain in the British Isles, and which is divided politically between Ireland and NorthernIreland.
geographic subregion: Western Europe

Jordan River
type: NamedIndividual
type: River
comment: JordanRiver is a non-navigable River in the MiddleEastRegion that flows North to South through the DeadSea, partially forms the border between Jordan and Israel (WestBank).
flows: Dead Sea
partly located: Jordan
partly located: Israel

Qinghai Hu
type: NamedIndividual
type: SaltLake
label: Koko Nor

Lake Bakhtegan
type: NamedIndividual
type: SaltLake

Lake Eyre
type: NamedIndividual
type: SaltLake
geographic subregion: Australia

Lake Maryut
type: NamedIndividual
type: SaltLake
label: Lake Mareotis

Lake Torrens
type: NamedIndividual
type: SaltLake

Lake Walker
type: NamedIndividual
type: SaltLake

United Nations Convention on the Law of the Sea
type: NamedIndividual
type: Agreement
label: Law of the Sea

Level
type: NamedIndividual
type: PositionalAttribute
comment: Level is a PositionalAttribute that describes the relation between two things, one of which is located down a slope from the other.
contrary attribute: Downhill
contrary attribute: Uphill

LowTerrain
type: NamedIndividual
type: TerrainAttribute
comment: LowTerrain is terrain in which the slope is less than 3%.

London Convention
type: NamedIndividual
type: Agreement
label: Marine Dumping
label: Convention on the Prevention of Marine Pollution by Dumping Wastes and Other Matter

Marine Life Conservation
type: NamedIndividual
type: Agreement
label: Convention on Fishing and Conservation of Living Resources of the High Seas

Mesoamerica
type: NamedIndividual
type: GeographicArea
label: Central America
label: Middle America
comment: MiddleAmerica represents the GeographicArea straddling the Continents of NorthAmerica and SouthAmerica.
overlaps spatially: NorthAmerica
geographic subregion: NorthernHemisphere
overlaps spatially: SouthAmerica
geographic subregion: WesternHemisphere

Middle East
type: NamedIndividual
type: GeographicArea
comment: MiddleEastRegion represents a GeopoliticalArea that comprises countries of Southwestern Asia and (in some definitions) Northwestern Africa. Here MiddleEastRegion is defined as in the CIA World Fact Book, in which the Middle East includes: Bahrain, Cyprus, the Gaza Strip, Iran, Iraq, Israel, Jordan, Kuwait, Lebanon, Oman, Qatar, Saudi Arabia, Syria, the United Arab Emirates, the West Bank, and Yemen.
overlaps spatially: Asia
geographic subregion: EasternHemisphere
geographic subregion: WesternHemisphere

MountainousTerrain
type: NamedIndividual
type: TerrainAttribute
comment: MountainousTerrain is a TerrainAttribute that describes an area of rugged terrain in which there are many mountains.
sub attribute: SteepTerrain

North America
type: NamedIndividual
type: Continent
type: GeographicArea
geographic subregion: NorthernHemisphere
geographic subregion: WesternHemisphere

North Atlantic
type: NamedIndividual
type: BodyOfWater
type: SaltWaterArea
label: North Atlantic Ocean
comment: NorthAtlanticOcean denotes the northern geographicSubregion of the AtlanticOcean.
geographic subregion: Atlantic Ocean
geographic subregion: NorthernHemisphere
geographic subregion: WesternHemisphere

North Pacific
type: NamedIndividual
type: BodyOfWater
type: SaltWaterArea
label: North Pacific Ocean
comment: NorthPacificOcean denotes the northern geographicSubregion of the PacificOcean.
partly located: EasternHemisphere
geographic subregion: NorthernHemisphere
geographic subregion: Pacific Ocean
partly located: WesternHemisphere

NorthPole
type: NamedIndividual
type: latitude
type: GeographicArea
comment: The NorthPole is the GeographicArea at the northern end of the axis of PlanetEarth. Its location is currently different from that of the MagneticNorthPole. The NorthPole is designated as 90 degrees North Latitude.

Northeast
type: NamedIndividual
type: DirectionalAttribute
comment: Northeast represents the compass direction of Northeast.
opposite direction: Southwest

Northern Africa
type: NamedIndividual
type: GeographicArea
comment: NorthernAfrica represents the northern GeographicArea of the Continent of Africa.
geographic subregion: Africa
overlaps spatially: EasternHemisphere
geographic subregion: NorthernHemisphere
overlaps spatially: WesternHemisphere

Northern Asia
type: NamedIndividual
type: GeographicArea
comment: NorthernAsia represents the northern GeographicArea of the Continent of Asia.
geographic subregion: Asia
geographic subregion: EasternHemisphere
geographic subregion: NorthernHemisphere

Northern Europe
type: NamedIndividual
type: GeographicArea
comment: NorthernEurope represents the northern GeographicArea of the Continent of Europe.
geographic subregion: EasternHemisphere
geographic subregion: Europe
geographic subregion: NorthernHemisphere

Northern North America
type: NamedIndividual
type: GeographicArea
comment: NorthernNorthAmerica represents the northern GeographicArea of the Continent of NorthAmerica.
geographic subregion: NorthAmerica

Northern South America
type: NamedIndividual
type: GeographicArea
comment: NorthernSouthAmerica represents the northern GeographicArea of the Continent of SouthAmerica.
overlaps spatially: NorthernHemisphere
geographic subregion: SouthAmerica
overlaps spatially: SouthernHemisphere
geographic subregion: WesternHemisphere

Northwest
type: NamedIndividual
type: DirectionalAttribute
comment: Northwest represents the compass direction of Northwest.
opposite direction: Southeast

Treaty Banning Nuclear Weapons Tests in the Atmosphere, in Outer Space, and Under Water
type: NamedIndividual
type: Agreement
label: Nuclear Test Ban

Oceania
type: NamedIndividual
type: Continent
type: GeographicArea
comment: As defined in the CIA World Fact Book (2002), Oceania denotes the Continent that comprises Australia and (most of) the PacificOcean islands.
overlaps spatially: EasternHemisphere
overlaps spatially: NorthernHemisphere
overlaps spatially: SouthernHemisphere
overlaps spatially: WesternHemisphere

blue water
type: NamedIndividual
type: Attribute
label: open sea
comment: OpenSea is the Attribute of a WaterArea that is open ocean beyond five NauticalMiles of land, also known as 'blue water'.

Opposite
type: NamedIndividual
type: PositionalAttribute
comment: Opposite is the PositionalAttribute that describes the relative orientation of two things that are separated by 180 AngularDegrees.

Montreal Protocol on Substances That Deplete the Ozone Layer
type: NamedIndividual
type: Agreement
label: Montreal Protocol
label: Ozone Layer Protection

OzoneShield
type: NamedIndividual
type: AtmosphericRegion
type: CompoundSubstance
comment: The OzoneShield is a layer in EarthsAtmosphere, located about 25 miles above Earth's surface, composed of ozone gas that absorbs ultraviolent radiation from the Sun that can be damaging to living things.

Persian Gulf
type: NamedIndividual
type: Gulf
type: SaltWaterArea
connected: Strait of Hormuz

Poopo Lake
type: NamedIndividual
type: SaltLake

prime meridian
type: NamedIndividual
type: meridian
label: Greenwich meridian
comment: The PrimeMeridian is the longitude line encircling PlanetEarth through the geographical NorthPole and SouthPole. It is designated as zero degrees Longitude. It is also known as the Greenwich meridian, because it passes through GreenwichEnglandUK, where the English Royal Observatory was located.

Salton Sea
type: NamedIndividual
type: SaltLake
geographic subregion: California

ScatteredVegetation
type: NamedIndividual
type: Attribute
comment: ScatteredVegetation describes the pattern of vegetation in which plants appear at intervals.

SeaLevel
type: NamedIndividual
type: GeographicArea
comment: SeaLevel is a GeographicArea, or layer, that circles PlanetEarth and is used as a reference point for measures of elevation. It may be considered as based on the global Mean Sea Surface (MSS), which in turn is based on all the local Mean Sea Levels (MSL). In fact, there are local variations in MSL, due to tides and long- and short-term weather conditions. The idealized reference ellipsoid used to 'smooth out' the local variations is called the 'geoid'.

MARPOL
type: NamedIndividual
type: Agreement
label: Ship Pollution
label: Protocol of 1978 Relating to the International Convention for the Prevention of Pollution From Ships, 1973

South America
type: NamedIndividual
type: Continent
overlaps spatially: NorthernHemisphere
overlaps spatially: SouthernHemisphere
geographic subregion: WesternHemisphere

South Atlantic
type: NamedIndividual
type: BodyOfWater
type: SaltWaterArea
label: South Atlantic Ocean
comment: SouthAtlanticOcean denotes the southern geographicSubregion of the AtlanticOcean.
geographic subregion: Atlantic Ocean
partly located: EasternHemisphere
geographic subregion: SouthernHemisphere
partly located: WesternHemisphere

South Pacific Ocean
type: NamedIndividual
type: BodyOfWater
type: SaltWaterArea
label: South Pacific
comment: SouthPacificOcean denotes the southern geographicSubregion of the PacificOcean.
partly located: EasternHemisphere
geographic subregion: Pacific Ocean
geographic subregion: SouthernHemisphere
partly located: WesternHemisphere

SouthPole
type: NamedIndividual
type: latitude
type: GeographicArea
comment: The SouthPole is the GeographicArea at the southern end of the axis of PlanetEarth. Its location is currently different from that of the MagneticSouthPole. The SouthPole is designated as 90 degrees South Latitude.

SouthSandwichTrench
type: NamedIndividual
type: OceanTrench
comment: SouthSandwichTrench represents the South Sandwich Trench in the SouthernOcean.
geographic subregion: Southern Ocean

Southeast
type: NamedIndividual
type: DirectionalAttribute
comment: Southeast represents the compass direction of Southeast.

South Eastern Asia
type: NamedIndividual
type: GeographicArea
label: Southeastern Asia
comment: SoutheasternAsia represents the southeastern GeographicArea of the Continent of Asia.
geographic subregion: Asia
geographic subregion: EasternHemisphere
overlaps spatially: NorthernHemisphere
overlaps spatially: SouthernHemisphere

Southeastern Europe
type: NamedIndividual
type: GeographicArea
comment: SoutheasternEurope represents the southeastern GeographicArea of the Continent of Europe.
geographic subregion: EasternHemisphere
geographic subregion: Europe
geographic subregion: NorthernHemisphere

Southern Africa
type: NamedIndividual
type: GeographicArea
comment: SouthernAfrica represents the southern GeographicArea of the Continent of Africa.
geographic subregion: Africa
geographic subregion: EasternHemisphere
geographic subregion: SouthernHemisphere

Southern Asia
type: NamedIndividual
type: GeographicArea
comment: SouthernAsia represents the southern GeographicArea of the Continent of Asia.
geographic subregion: Asia
geographic subregion: EasternHemisphere
overlaps spatially: NorthernHemisphere
overlaps spatially: SouthernHemisphere

Southern Europe
type: NamedIndividual
type: GeographicArea
comment: SouthernEurope represents the southern GeographicArea of the Continent of Europe.
geographic subregion: EasternHemisphere
geographic subregion: Europe
geographic subregion: NorthernHemisphere

Southern Ocean
type: NamedIndividual
type: Ocean
type: PolarClimateZone
comment: SouthernOcean represents the Southern Ocean.
natural hazard type in area: CyclonicStorm
natural hazard type in area: Iceberg
natural hazard type in area: SeaIce
partly located: EasternHemisphere
geographic subregion: SouthernHemisphere
partly located: WesternHemisphere

Southern South America
type: NamedIndividual
type: GeographicArea
comment: SouthernSouthAmerica represents the southern GeographicArea of the Continent of SouthAmerica.
geographic subregion: SouthAmerica
geographic subregion: SouthernHemisphere
geographic subregion: WesternHemisphere

Southwest
type: NamedIndividual
type: DirectionalAttribute
comment: Southwest represents the compass direction of Southwest.

South Western Asia
type: NamedIndividual
type: GeographicArea
label: Southwestern Asia
comment: SouthwesternAsia represents the southwestern GeographicArea of the Continent of Asia.
geographic subregion: Asia
geographic subregion: EasternHemisphere
geographic subregion: NorthernHemisphere

Southwestern Europe
type: NamedIndividual
type: GeographicArea
comment: SouthwesternEurope represents the southwestern GeographicArea of the Continent of Europe.
overlaps spatially: EasternHemisphere
geographic subregion: Europe
geographic subregion: NorthernHemisphere
overlaps spatially: WesternHemisphere

SparseVegetation
type: NamedIndividual
type: Attribute
comment: SparseVegetation describes the pattern of vegetation in an area where there is very little vegetation.

SteepTerrain
type: NamedIndividual
type: TerrainAttribute
comment: SteepTerrain is the TerrainAttribute that describes a region in which there is a slopeGradient of more than 10%. There may be a wide variation in elevation and gradient in the parts of the region.

Strait of Hormuz
type: NamedIndividual
type: Strait
type: SaltWaterArea
connected: Gulf of Oman

Tailwind
type: NamedIndividual
type: Attribute
comment: Tailwind is the relative attribute of a Wind to an object when the force of the wind is applied to the back of the object (BackFn). A tailwind can positively affect the speed capability of a vehicle.

Tropical Timber 83
type: NamedIndividual
type: Agreement
label: International Tropical Timber Agreement, 1983

International Tropical Timber Agreement, 1994
type: NamedIndividual
type: Agreement
label: Tropical Timber 94

Tropics
type: NamedIndividual
type: GeographicArea
label: the Tropics
comment: The Tropics is the region of PlanetEarth that lies between approximately 23 and one half degrees North latitude and 23 and one half degrees South latitude, encircling the globe. 'The Tropics'. See also TropicArea.
overlaps spatially: EasternHemisphere
overlaps spatially: NorthernHemisphere
overlaps spatially: SouthernHemisphere
overlaps spatially: WesternHemisphere

Uphill
type: NamedIndividual
type: PositionalAttribute
comment: Uphill is a PositionalAttribute that describes the relation between two things, one of which is located up a slope from the other.
contrary attribute: Downhill

Upstream
type: NamedIndividual
type: PositionalAttribute
comment: Upstream is a PositionalAttribute that describes the orientation of being in the area or direction from which a Fluid is flowing.
opposite attribute: Downstream

Upwind
type: NamedIndividual
type: PositionalAttribute
comment: Upwind is a PositionalAttribute that indicates relative position upwind (windward) with respect to the direction that the Wind is blowing.
sub attribute: Upstream

VolcanicallyActive
type: NamedIndividual
type: VolcanoStatus
comment: VolcanicallyActive is the state of a Volcano in which volcanic activity is ongoing, with either a current VolcanicEruption or active preconditions for one.

VolcanicallyDormant
type: NamedIndividual
type: VolcanoStatus
comment: VolcanicallyDormant is the state of a Volcano in which there is no current or imminent VolcanicEruption, but which still shows signs of volcanic potential, i.e., it is not yet considered extinct.

VolcanicallyExtinct
type: NamedIndividual
type: VolcanoStatus
comment: VolcanicallyExtinct is the state of a Volcano in which there is no current VolcanicEruption nor any signs volcanic potential, i.e., it is considered extinct.

Western Africa
type: NamedIndividual
type: GeographicArea
comment: WesternAfrica represents the western GeographicArea of the Continent of Africa.
geographic subregion: Africa
overlaps spatially: EasternHemisphere
overlaps spatially: NorthernHemisphere
overlaps spatially: SouthernHemisphere
overlaps spatially: WesternHemisphere

Western Europe
type: NamedIndividual
type: GeographicArea
comment: WesternEurope represents the western GeographicArea of the Continent of Europe.
overlaps spatially: EasternHemisphere
geographic subregion: Europe
geographic subregion: NorthernHemisphere
overlaps spatially: WesternHemisphere

Western South America
type: NamedIndividual
type: GeographicArea
comment: WesternSouthAmerica represents the western GeographicArea of the Continent of SouthAmerica.
overlaps spatially: NorthernHemisphere
geographic subregion: SouthAmerica
overlaps spatially: SouthernHemisphere
geographic subregion: WesternHemisphere

Wetlands
type: NamedIndividual
type: Agreement
label: Ramsar Convention
label: Convention on Wetlands of International Importance Especially as Waterfowl Habitat

International Convention for the Regulation of Whaling
type: NamedIndividual
type: Agreement
label: Whaling

Arctic
type: NamedIndividual
type: GeographicArea
label: the Arctic
comment: The ArcticRegion is the region of PlanetEarth that lies north of the Arctic Circle (approximately 66 and one half degrees North latitude) or beyond the northern treeline: 'The Arctic'.
overlaps spatially: EasternHemisphere
geographic subregion: NorthernHemisphere
overlaps spatially: WesternHemisphere

Atlantic Ocean
type: NamedIndividual
type: Ocean
comment: AtlanticOcean represents the Atlantic Ocean.

EarthsAtmosphere
type: NamedIndividual
type: Atmosphere
comment: EarthsAtmosphere is the layer of gases, a mixture of mainly oxygen and nitrogen, surrounding PlanetEarth. See also Air.

EarthsMoon
type: NamedIndividual
type: Moon
comment: EarthsMoon is the Moon of PlanetEarth.
orbits: PlanetEarth

Europe
type: NamedIndividual
type: Continent
overlaps spatially: EasternHemisphere
geographic subregion: NorthernHemisphere
overlaps spatially: WesternHemisphere

Outside
type: NamedIndividual
type: PositionalAttribute
comment: Outside is a PositionAttribute used to describe the relative location of one object or region to another region. For example, (orientation Cuba UnitedStates Outside).

Pacific Ocean
type: NamedIndividual
type: Ocean
comment: PacificOcean represents the Pacific Ocean.

Palestine
type: NamedIndividual
type: GeographicArea
comment: Palestine is a GeographicArea in the MiddleEastRegion that partly overlaps the state of Israel. Historically, the name Palestine has had varying extents and references, including a former country that was part of the Ottoman Empire from 1516 -1917 and a mandate of the British Empire from 1923-1948, as well as the Biblical nation of Canaan. The area now referred to by this name is largely coextensive with Israel, though historically Palestine included parts of Jordan and Egypt. The core area of the region is the land between the MediterraneanSea and the JordanRiver.
geographic subregion: Middle East
partly located: Israel

Sol
type: NamedIndividual
type: Star
comment: Sol is the nearest Star to PlanetEarth and the focus of its SolarSystem.

world ocean
type: NamedIndividual
type: BodyOfWater
type: SaltWaterArea
label: the ocean
comment: The WorldOcean is the collective mass of sea water that covers 70% of the surface of PlanetEarth, surrounding all of its dry land areas. Earth's individual Oceans and Seas are parts of the WorldOcean.