Image Config
type: AnnotationProperty
comment: An attribute relating to Image Configuration
sub property of: Exif Attribute

CompressedBitsPerPixel
type: AnnotationProperty
tag number: 37122
comment: Information specific to compressed data. The compression mode used for a compressed image is indicated in unit bits per pixel.
comment: 画�?�?�圧縮率 @ja
sub property of: Image Config

IFD Pointer
type: AnnotationProperty
comment: A tag that refers a child IFD
sub property of: Exif Attribute

Version Info
type: AnnotationProperty
comment: An attribute relating to Version
sub property of: Exif Attribute

RowsPerStrip
type: AnnotationProperty
tag number: 278
comment: The number of rows per strip. This is the number of rows in the image of one strip when an image is divided into strips. With JPEG compressed data this designation is not needed and is omitted.
sub property of: Recording Offset

ComponentsConfiguration
type: AnnotationProperty
tag number: 37121
comment: Information specific to compressed data. The channels of each component are arranged in order from the 1st component to the 4th. For uncompressed data the data arrangement is given in the PhotometricInterpretation tag. However, since PhotometricInterpretation can only express the order of Y,Cb and Cr, this tag is provided for cases when compressed data uses components other than Y, Cb, and Cr and to enable support of other sequences.
comment: 圧縮データ�?�YCC以外�?�並�?��?�場�?��?4�?イト�?��??�?�並�?�を示�?�。�??れ�?�れ�?�値�?�0:not exist,1:Y,2:Cb,3:Cr,4:R,5:G,6:B @ja
sub property of: Image Config

GPSTimeStamp
type: AnnotationProperty
tag number: 7
comment: The time as UTC (Coordinated Universal Time). TimeStamp is expressed as three RATIONAL values giving the hour, minute, and second.
sub property of: GPS Info

ImageUniqueID
type: AnnotationProperty
tag number: 42016
comment: An identifier assigned uniquely to each image. It is recorded as an ASCII string equivalent to hexadecimal notation and 128-bit fixed length.
sub property of: identifier
sub property of: Exif Attribute

ImageLength
type: AnnotationProperty
tag number: 257
comment: Image height. The number of rows of image data. In JPEG compressed data a JPEG marker is used.
sub property of: Height
sub property of: Image Data Structure

MeteringMode
type: AnnotationProperty
tag number: 37383
comment: Metering mode, such as CenterWeightedAverage, Spot, MultiSpot,Pattern, Partial etc.
comment: 自動露出�?�測光モード @ja
sub property of: PictTaking

ColorSpace
type: AnnotationProperty
tag number: 40961
comment: The color space information tag (ColorSpace) is always recorded as the color space specifier. Normally sRGB (=1) is used to define the color space based on the PC monitor conditions and environment.
comment: 使�?れる色空間。通常sRGB @ja
sub property of: Image Data Character

PhotometricInterpretation
type: AnnotationProperty
tag number: 262
comment: Pixel composition. In JPEG compressed data a JPEG marker is used instead of this tag.
sub property of: Image Data Structure

FlashEnergy
type: AnnotationProperty
tag number: 41483
comment: The strobe energy at the time the image is captured, as measured in Beam Candle Power Seconds (BCPS).
comment: BCPS�?�よるストロボ�?�強度 @ja
sub property of: PictTaking

ShutterSpeedValue
type: AnnotationProperty
tag number: 37377
comment: Shutter speed. The unit is the APEX (Additive System of Photographic Exposure) setting
comment: シャッター速度（APEX値）。�?��?�値�?�2�?�ベキ乗を�?��?��?�逆数�?��?�る�?��?通常�?�シャッター速度表示�?��?�る。例�?��?�'4'�?�場�?��?��?�1/(2^4)=1/16秒 @ja
sub property of: PictTaking

SpatialFrequencyResponse
type: AnnotationProperty
tag number: 41484
comment: This tag records the camera or input device spatial frequency table and SFR values in the direction of image width, image height, and diagonal direction, as specified in ISO 12233.
sub property of: PictTaking

Geometric data
comment: Geometric data such as latitude, longitude and altitude. Usually saved as rational number.

DateTimeDigitized
type: AnnotationProperty
tag number: 36868
comment: The date and time when the image was stored as digital data. If, for example, an image was captured by DSC and at the same time the file was recorded, then the DateTimeOriginal and DateTimeDigitized will have the same contents.
comment: 画�?�?�デジタル化�?�れ�?�日時。デジカメ画�?�?�ら通常DateTimeOriginal�?��?��?�値 @ja
sub property of: Date
sub property of: Date and/or Time

WhitePoint
type: AnnotationProperty
tag number: 318
comment: The chromaticity of the white point of the image. Normally this tag is not necessary, since color space is specified in the color space information tag (ColorSpace).
comment: 白点�?�色度。CIE Standard Illuminant D65(�?��?ゆる昼光色�?�世界標準値)を使�?��?��?�れ�?��?'3127/10000,3290/10000'�?��?��?�値。通常�?�ColorSpaceタグ�?��?�る�?��?��?�? @ja
sub property of: Image Data Character

RelatedImageWidth
type: AnnotationProperty
tag number: 4097
comment: Related image width
comment: 画�?幅。通常�?�サム�?イル画�?�?�Interoperability IFD�?�使�?� @ja
sub property of: Interoperability Info
sub property of: Width

Interoperability Info
type: AnnotationProperty
comment: An attribute relating to Interoperability. Tags stored in Interoperability IFD may be defined dependently to each Interoperability rule.
sub property of: Exif Attribute

User Info
type: AnnotationProperty
comment: An attribute relating to User Information
sub property of: Exif Attribute

GPSLongitudeRef
type: AnnotationProperty
tag number: 3
comment: Indicates whether the longitude is east or west longitude. ASCII 'E' indicates east longitude, and 'W' is west longitude.
comment: 経度�?��?�経も�?��??�?�西経 @ja
sub property of: GPS Info

ImageDescription
type: AnnotationProperty
tag number: 270
comment: A character string giving the title of the image. It may be a comment such as "1988 company picnic" or the like. Two-byte character codes cannot be used. When a 2-byte code is necessary, the Exif Private tag UserComment is to be used.
comment: �?��?�画�?�?��?��?��?��?�説明。漢字等�?�2�?イト文字�?�使用�?��?止 @ja
sub property of: title
sub property of: Exif Attribute

GPSStatus
type: AnnotationProperty
tag number: 9
comment: The status of the GPS receiver when the image is recorded. 'A' means measurement is in progress, and 'V' means the measurement is Interoperability.
sub property of: GPS Info

JPEGInterchangeFormat
type: AnnotationProperty
tag number: 513
comment: The offset to the start byte (SOI) of JPEG compressed thumbnail data. This is not used for primary image JPEG data.
comment: 圧縮�?�れ�?�サム�?イル�?��?�オフセット @ja
sub property of: Recording Offset

ExposureTime
type: AnnotationProperty
tag number: 33434
comment: Exposure time, given in seconds (sec).
comment: 露光時間（シャッター速度�?�逆数）。�?��?�?�秒 @ja
sub property of: PictTaking
sub property of: Seconds

ApertureValue
type: AnnotationProperty
tag number: 37378
comment: The lens aperture. The unit is the APEX value.
comment: レンズ絞り値（APEX値）。�?��?�値�?�ルート2�?�ベキ乗を�?�る�?��?通常�?�絞り値�?��?�る。例�?��?�'5'�?�場�?��?��?�√2^5=F5.6 @ja
sub property of: PictTaking

Date
type: AnnotationProperty
comment: a date information. Usually saved as YYYY:MM:DD (HH:MM:SS) format in Exif data, but represented here as W3C-DTF format
sub property of: date

Copyright
type: AnnotationProperty
tag number: 33432
comment: Copyright information. In this standard the tag is used to indicate both the photographer and editor copyrights. It is the copyright notice of the person or organization claiming rights to the image.
comment: �?��?�画�?�?�撮影者�?�よ�?�編集者�?�著作権情報 @ja
sub property of: rights
sub property of: Exif Attribute

FocalLengthIn35mmFilm
type: AnnotationProperty
tag number: 41989
comment: The equivalent focal length assuming a 35mm film camera, in mm. A value of 0 means the focal length is unknown. Note that this tag differs from the FocalLength tag.
comment: 35mm�?�算�?��?�焦点�?離 @ja
sub property of: Length
sub property of: PictTaking

MakerNote
type: AnnotationProperty
tag number: 37500
comment: Manufacturer notes
comment: カメラ�?�内部情報等�?メーカー�?存データ @ja
sub property of: User Info

YCbCrPositioning
type: AnnotationProperty
tag number: 531
comment: The position of chrominance components in relation to the luminance component. This field is designated only for JPEG compressed data or uncompressed YCbCr data.
comment: 色情報�?�サンプリングを間引�??�?��?��?�る場�?��?��?色情報�?�サンプル�?イント�?��?��?��?��?�る�?�。1='centered'�?�ら点集�?��?�中央�?2�?'co-sited'�?�ら点集�?��?�原点 @ja
sub property of: Image Data Structure

GPSProcessingMethod
type: AnnotationProperty
tag number: 27
comment: A character string recording the name of the method used for location finding. The first byte indicates the character code used, and this is followed by the name of the method.
sub property of: GPS Info

ISOSpeedRatings
type: AnnotationProperty
tag number: 34855
comment: Indicates the ISO Speed and ISO Latitude of the camera or input device as specified in ISO 12232.
comment: CCD感度�?�銀塩フィルム�?�算値 @ja
sub property of: PictTaking

Width
type: AnnotationProperty
comment: Width of an object
sub property of: Length

GPS Info
type: AnnotationProperty
comment: An attribute relating to GPS information
sub property of: Exif Attribute

GPSMeasureMode
type: AnnotationProperty
tag number: 10
comment: The GPS measurement mode. '2' means two-dimensional measurement and '3' means three-dimensional measurement is in progress.
sub property of: GPS Info

ExifVersion
type: AnnotationProperty
tag number: 36864
comment: Exif Version
comment: Exif形�?�?��?ージョン @ja
sub property of: Version Info

PrintIM ColorBalance
type: AnnotationProperty
tag number: 11
comment: ColorBalance info for print image matching
sub property of: PIM Info

SubjectArea
type: AnnotationProperty
tag number: 37396
comment: The location and area of the main subject in the overall scene.
comment: 画�?�中�?�主�?�る被写体�?��?置。2値�?�よるXY座標�?3値�?�よる円�?4値�?�よる長方形座標�?�3通り�?�示�?�方�?��?�る @ja
sub property of: PictTaking

SensingMethod
type: AnnotationProperty
tag number: 41495
comment: The image sensor type on the camera or input device, such as One-chip color area sensor etc.
comment: イメージセンサー�?�形�?。One-chip color area sensor�?Color sequential area sensor�?Trilinear sensor�?��?� @ja
sub property of: PictTaking

SubSecTimeOriginal
type: AnnotationProperty
tag number: 37521
comment: DateTimeOriginal subseconds
sub property of: Date and/or Time
sub property of: subsecond

GPSInfo IFD Pointer
type: AnnotationProperty
tag number: 34853
comment: A pointer to the GPS IFD, which is a set of tags for recording GPS information.
comment: GPS IFD�?��?��?インタ @ja
sub property of: IFD Pointer

GPSDOP
type: AnnotationProperty
tag number: 11
comment: The GPS DOP (data degree of precision). An HDOP value is written during two-dimensional measurement, and PDOP during three-dimensional measurement.
sub property of: GPS Info

StripOffsets
type: AnnotationProperty
tag number: 273
comment: For each strip, the byte offset of that strip. With JPEG compressed data this designation is not needed and is omitted.
sub property of: Recording Offset

Tag ID
type: AnnotationProperty
comment: The Exif tag number with context prefix, such as IFD type or maker name
sub property of: Tag number

ExposureIndex
type: AnnotationProperty
tag number: 41493
comment: The exposure index selected on the camera or input device at the time the image is captured.
comment: CCD感度。データ形�?�?�符�?��?��?�分数�?��?�る事を除�??�?ISOSpeedRatings�?��?��?� @ja
sub property of: PictTaking

InteroperabilityVersion
type: AnnotationProperty
tag number: 2
comment: Interoperability Version
comment: データ�?�内容�?�ExifR98 v1.0準拠�?�場�?��?��?'0100'�?�文字列。 @ja
sub property of: Interoperability Info

SubjectDistanceRange
type: AnnotationProperty
tag number: 41996
comment: The distance to the subject, such as Macro, Close View or Distant View.
sub property of: PictTaking

GPSLongitude
type: AnnotationProperty
tag number: 4
comment: The longitude, expressed as three values giving the degrees, minutes, and seconds, respectively.
comment: 経度 @ja
sub property of: Geometric data
sub property of: GPS Info

SubjectLocation
type: AnnotationProperty
tag number: 41492
comment: The location of the main subject in the scene. The value of this tag represents the pixel at the center of the main subject relative to the left edge, prior to rotation processing as per the Rotation tag. The first value indicates the X column number and second indicates the Y row number.
comment: 画�?�中�?�主�?被写体�?�XY座標 @ja
sub property of: PictTaking

ExposureMode
type: AnnotationProperty
tag number: 41986
comment: the exposure mode set when the image was shot. In auto-bracketing mode, the camera shoots a series of frames of the same scene at different exposure settings.
comment: 露光モード @ja
sub property of: PictTaking

PrintImageMatching IFD Pointer
type: AnnotationProperty
tag number: 50341
comment: A pointer to the print image matching IFD
sub property of: IFD Pointer

GPSDestDistanceRef
type: AnnotationProperty
tag number: 25
comment: Indicates the unit used to express the distance to the destination point. 'K', 'M' and 'N' represent kilometers, miles and knots.
sub property of: GPS Info

Related File
type: AnnotationProperty
comment: Tag Relating to Related File Information
sub property of: Exif Attribute

Compression
type: AnnotationProperty
tag number: 259
comment: The compression scheme used for the image data. When a primary image is JPEG compressed, this designation is not necessary and is omitted. When thumbnails use JPEG compression, this tag value is set to 6.
sub property of: Image Data Structure

FocalPlaneResolutionUnit
type: AnnotationProperty
tag number: 41488
comment: The unit for measuring FocalPlaneXResolution and FocalPlaneYResolution. This value is the same as the ResolutionUnit.
comment: CCD画素密度�?��?��? @ja
sub property of: PictTaking

GPSDestBearingRef
type: AnnotationProperty
tag number: 23
comment: Indicates the reference used for giving the bearing to the destination point. 'T' denotes true direction and 'M' is magnetic direction.
sub property of: GPS Info

GPSDestLatitudeRef
type: AnnotationProperty
tag number: 19
comment: Reference for latitude of destination
sub property of: GPS Info

SceneCaptureType
type: AnnotationProperty
tag number: 41990
comment: The type of scene that was shot. It can also be used to record the mode in which the image was shot, such as Landscape, Portrait etc. Note that this differs from the scene type (SceneType) tag.
sub property of: PictTaking

Interoperability IFD Pointer
type: AnnotationProperty
tag number: 40965
comment: A pointer to the Interoperability IFD, which is composed of tags storing the information to ensure the Interoperability
comment: Interoperability IFD�?��?��?インタ @ja
sub property of: IFD Pointer

ReferenceBlackWhite
type: AnnotationProperty
tag number: 532
comment: The reference black point value and reference white point value. The color space is declared in a color space information tag, with the default being the value that gives the optimal image characteristics Interoperability these conditions.
comment: 画�?情報�?�黒点・白点値。YCbCr形�?�?�場�?��?最�?�?�２�?��?�値�?�Y(�?度)�?�黒点・白点�?次�?�Cb�?最後�?�Cr�?��?�り�?デフォルト値�?�'0,255,0,128,0,128'。RGB形�?�?�場�?��?�R�?G�?B�?�順�?�黒点・白点値�?�並ん�?��?�り�?デフォルト値�?�'0,255,0,255,0,255'。 @ja
sub property of: Image Data Character

GPSVersionID
type: AnnotationProperty
tag number: 0
comment: The version of GPSInfoIFD. The version is given as 2.2.0.0. This tag is mandatory when GPSInfo tag is present.
sub property of: GPS Info
sub property of: Version Info

ResolutionUnit
type: AnnotationProperty
tag number: 296
comment: The unit for measuring XResolution and YResolution. The same unit is used for both XResolution and YResolution. If the image resolution in unknown, 2 (inches) is designated.
comment: XResolution/YResolution�?�解�?度�?��?��? @ja
sub property of: Image Data Structure

MaxApertureValue
type: AnnotationProperty
tag number: 37381
comment: The smallest F number of the lens. The unit is the APEX value. Ordinarily it is given in the range of 00.00 to 99.99, but it is not limited to this range.
comment: レンズ�?�開放F値。ApertureValue�?�様�?ルート2�?�ベキ乗を�?�る�?�通常�?�絞り値�?��?�算�?��??る @ja
sub property of: PictTaking

PixelYDimension
type: AnnotationProperty
tag number: 40963
comment: Information specific to compressed data. When a compressed file is recorded, the valid height of the meaningful image shall be recorded in this tag, whether or not there is padding data or a restart marker. This tag should not exist in an uncompressed file. Since data padding is unnecessary in the vertical direction, the number of lines recorded in this valid image height tag will in fact be the same as that recorded in the SOF.
sub property of: Height
sub property of: Image Config

LightSource
type: AnnotationProperty
tag number: 37384
comment: Light source such as Daylight, Tungsten, Flash etc.
comment: 光�?。�?�れ�?�マニュアル�?�ホワイト�?ランスを設定�?��?�場�?��?�モード値�?��?�る @ja
sub property of: PictTaking

GPSLatitudeRef
type: AnnotationProperty
tag number: 1
comment: Indicates whether the latitude is north or south latitude. The ASCII value 'N' indicates north latitude, and 'S' is south latitude.
comment: 緯度�?�北緯も�?��??�?��?�緯 @ja
sub property of: GPS Info

SubjectDistance
type: AnnotationProperty
tag number: 37382
comment: The distance to the subject, given in meters. Note that if the numerator of the recorded value is FFFFFFFF.H, Infinity shall be indicated; and if the numerator is 0, Distance unknown shall be indicated.
comment: 被写体�?��?��?��?離。�?��?�?�m @ja
sub property of: Meter
sub property of: PictTaking

GPSSpeedRef
type: AnnotationProperty
tag number: 12
comment: The unit used to express the GPS receiver speed of movement. 'K' 'M' and 'N' represents kilometers per hour, miles per hour, and knots.
sub property of: GPS Info

GPSImgDirectionRef
type: AnnotationProperty
tag number: 16
comment: The reference for giving the direction of the image when it is captured. 'T' denotes true direction and 'M' is magnetic direction.
sub property of: GPS Info

RelatedImageFileFormat
type: AnnotationProperty
tag number: 4096
comment: Related image file format
comment: 画�?フォーマットを'Exif JPEG Ver. 2.1'�?��?��?�文字列�?�示�?�。通常�?�サム�?ィル画�?�?�使�?� @ja
sub property of: Interoperability Info

SubSecTimeDigitized
type: AnnotationProperty
tag number: 37522
comment: DateTimeDigitized subseconds
sub property of: Date and/or Time
sub property of: subsecond

Software
type: AnnotationProperty
tag number: 305
comment: The name and version of the software or firmware of the camera or image input device used to generate the image.
comment: デジカメ（も�?��??�?�入力機器）�?�内蔵ソフトウェア/ファームウェア�?��??称�?��?ージョン @ja
sub property of: label
sub property of: Exif Attribute

GainControl
type: AnnotationProperty
tag number: 41991
comment: The degree of overall image gain adjustment.
sub property of: PictTaking

Height
type: AnnotationProperty
comment: Height of an object
sub property of: Length

Date and/or Time
type: AnnotationProperty
comment: An attribute relating to Date and/or Time
sub property of: Exif Attribute

FocalPlaneXResolution
type: AnnotationProperty
tag number: 41486
comment: The number of pixels in the image width (X) direction per FocalPlaneResolutionUnit on the camera focal plane.
comment: 撮影画�?�?�CCD�?置�?��?�水平解�?度。�?��?�値�?�FocalPlaneYResolution�?FocalLengthを使�?��?��?レンズ焦点�?離�?�35mmカメラ�?�算値�?�計算�?��??る。例�?��?�200万画素機を使�?�VGAモード�?�画�?を撮�?��?�よ�?��?�場�?��?��?��?�値�?�VGA�?�解�?度�?�リサンプル�?�れ�?�値�?��?��?��?��?�り�?CCD�?�画素ピッ�?�??�?��?��?��?�値�?��?��?��?��?��?�注�?�?�必�? @ja
sub property of: PictTaking
sub property of: Resolution

ExposureProgram
type: AnnotationProperty
tag number: 34850
comment: The class of the program used by the camera to set exposure when the picture is taken.
comment: 露光制御�?�モード @ja
sub property of: PictTaking

DeviceSettingDescription
type: AnnotationProperty
tag number: 41995
comment: Information on the picture-taking conditions of a particular camera model. The tag is used only to indicate the picture-taking conditions in the reader.
sub property of: PictTaking

SubSecTime
type: AnnotationProperty
tag number: 37520
comment: DateTime subseconds
sub property of: Date and/or Time
sub property of: subsecond

InteroperabilityIndex
type: AnnotationProperty
tag number: 1
comment: Indicates the identification of the Interoperability rule. 'R98' = conforming to R98 file specification of Recommended Exif Interoperability Rules (ExifR98) or to DCF basic file stipulated by Design Rule for Camera File System. 'THM' = conforming to DCF thumbnail file stipulated by Design rule for Camera File System.
comment: メイン画�?�?�Interoperability IFD�?��?データ�?�内容�?�ExifR98 v1.0準拠�?�場�?��?��?'R98'�?�文字列。サム�?ィル画�?�?�Interoperability IFD�?�場�?��?��?'THM'�?�文字列 @ja
sub property of: Interoperability Info

GPSDateStamp
type: AnnotationProperty
tag number: 29
comment: date and time information relative to UTC (Coordinated Universal Time). The record format is "YYYY:MM:DD" while converted to W3C-DTF to use in RDF
sub property of: Date
sub property of: GPS Info

XResolution
type: AnnotationProperty
tag number: 282
comment: The number of pixels per ResolutionUnit in the ImageWidth direction. When the image resolution is unknown, 72 [dpi] is designated.
comment: 画�?�?�表示・�?�刷時�?�水平解�?度 @ja
sub property of: Image Data Structure
sub property of: Resolution

PrimaryChromaticities
type: AnnotationProperty
tag number: 319
comment: The chromaticity of the three primary colors of the image. Normally this tag is not necessary, since color space is specified in the color space information tag (ColorSpace).
comment: 原色�?�色度。CCIR REcommendation 709 primariesを使�?��?��?�る場�?��?��?'640/1000,330/1000,300/1000,600/1000,150/1000,60/1000'�?��?��?�値。通常�?�ColorSpaceタグ�?��?�る�?��?��?�? @ja
sub property of: Image Data Character

CustomRendered
type: AnnotationProperty
tag number: 41985
comment: The use of special processing on image data, such as rendering geared to output. When special processing is performed, the reader is expected to disable or minimize any further processing.
comment: 特別�?�レンダリング処�?�を行�?��?��?�る�?��?��?��?� @ja
sub property of: PictTaking

PrintIM Saturation
type: AnnotationProperty
tag number: 12
comment: Saturation info for print image matching
sub property of: PIM Info

FocalLength
type: AnnotationProperty
tag number: 37386
comment: The actual focal length of the lens, in mm. Conversion is not made to the focal length of a 35 mm film camera.
comment: レンズ�?�焦点�?離。�?��?�?�mm @ja
sub property of: Milimeter
sub property of: PictTaking

GPSDestLongitudeRef
type: AnnotationProperty
tag number: 21
comment: Reference for longitude of destination
sub property of: GPS Info

FileSource
type: AnnotationProperty
tag number: 41728
comment: The image source. If a DSC recorded the image, this tag value of this tag always be set to 3, indicating that the image was recorded on a DSC.
comment: 画�?�?��?��?��?��?�デ�?イス�?�ら得られ�?��?�。通常3=DSC @ja
sub property of: PictTaking

Saturation
type: AnnotationProperty
tag number: 41993
comment: The direction of saturation processing applied by the camera when the image was shot.
sub property of: PictTaking

DateTimeOriginal
type: AnnotationProperty
tag number: 36867
comment: The date and time when the original image data was generated. For a DSC the date and time the picture was taken are recorded.
comment: オリジナル画�?�?�作�?（撮影）�?�れ�?�日時 @ja
sub property of: Date
sub property of: Date and/or Time

FlashpixVersion
type: AnnotationProperty
tag number: 40960
comment: The Flashpix format version supported by a FPXR file. If the FPXR function supports Flashpix format Ver. 1.0, this is indicated similarly to ExifVersion by recording "0100" as 4-byte ASCII.
sub property of: Version Info

PixelXDimension
type: AnnotationProperty
tag number: 40962
comment: Information specific to compressed data. When a compressed file is recorded, the valid width of the meaningful image shall be recorded in this tag, whether or not there is padding data or a restart marker. This tag should not exist in an uncompressed file.
sub property of: Image Config
sub property of: Width

GPSAltitudeRef
type: AnnotationProperty
tag number: 5
comment: Indicates the altitude used as the reference altitude. If the reference is sea level and the altitude is above sea level, 0 is given. If the altitude is below sea level, a value of 1 is given and the altitude is indicated as an absolute value in the GPSAltitude tag. The reference unit is meters.
sub property of: GPS Info

RelatedSoundFile
type: AnnotationProperty
tag number: 40964
comment: Related audio file
comment: 画�?�?�一緒�?�音声録音�?��??る機種�?�場�?��?��?音声ファイル�?��??�? @ja
sub property of: Related File

BitsPerSample
type: AnnotationProperty
tag number: 258
comment: The number of bits per image component. In this standard each component of the image is 8 bits, so the value for this tag is 8. See also SamplesPerPixel. In JPEG compressed data a JPEG marker is used instead of this tag.
sub property of: Image Data Structure
sub property of: Resolution

GPSDestLongitude
type: AnnotationProperty
tag number: 22
comment: Longitude of destination, expressed as three values giving the degrees, minutes, and seconds, respectively.
sub property of: Geometric data
sub property of: GPS Info

PrintIM Contrast
type: AnnotationProperty
tag number: 9
comment: Contrast info for print image matching
sub property of: PIM Info

CFAPattern
type: AnnotationProperty
tag number: 41730
comment: The color filter array (CFA) geometric pattern of the image sensor when a one-chip color area sensor is used. It does not apply to all sensing methods.
comment: CCD�?�付�?��?��?�るColor filter array(CFA)�?�パターン。例�?��?�普通�?�RGBフィルター�?��?��?CFAPattern�?�データ�?� 02 02 00 01 01 02 @ja
sub property of: PictTaking

PlanarConfiguration
type: AnnotationProperty
tag number: 284
comment: Indicates whether pixel components are recorded in chunky or planar format. In JPEG compressed files a JPEG marker is used instead of this tag. If this field does not exist, the TIFF default of 1 (chunky) is assumed.
sub property of: Image Data Structure

YCbCrSubSampling
type: AnnotationProperty
tag number: 530
comment: The sampling ratio of chrominance components in relation to the luminance component. In JPEG compressed data a JPEG marker is used instead of this tag.
sub property of: Image Data Structure

SceneType
type: AnnotationProperty
tag number: 41729
comment: The type of scene. If a DSC recorded the image, this tag value shall always be set to 1, indicating that the image was directly photographed.
comment: 画�?�?��?��?�や�?��?�撮られ�?��?�。デジカメ�?�場�?��?�通常1=A directly photographed image @ja
sub property of: PictTaking

YCbCrCoefficients
type: AnnotationProperty
tag number: 529
comment: The matrix coefficients for transformation from RGB to YCbCr image data.
comment: RGB形�?�?�らYCbCr形�?�?�変�?��?�る�?��?�?�3�?��?�係数。通常�?�0.299�?0.587�?0.114�?��?��?�値 @ja
sub property of: Image Data Character

GPSDifferential
type: AnnotationProperty
tag number: 30
comment: Indicates whether differential correction is applied to the GPS receiver.
sub property of: GPS Info

SamplesPerPixel
type: AnnotationProperty
tag number: 277
comment: The number of components per pixel. Since this standard applies to RGB and YCbCr images, the value set for this tag is 3. In JPEG compressed data a JPEG marker is used instead of this tag.
sub property of: Image Data Structure

Resolution
comment: a rational number representing a resolution. Could be a subProperty of other general schema.

OECF
type: AnnotationProperty
tag number: 34856
comment: Indicates the Opto-Electric Conversion Function (OECF) specified in ISO 14524. OECF is the relationship between the camera optical input and the image values.
sub property of: PictTaking

ImageWidth
type: AnnotationProperty
tag number: 256
comment: Image width. The number of columns of image data, equal to the number of pixels per row. In JPEG compressed data a JPEG marker is used instead of this tag.
sub property of: Image Data Structure
sub property of: Width

GPSTrackRef
type: AnnotationProperty
tag number: 14
comment: The reference for giving the direction of GPS receiver movement. 'T' denotes true direction and 'M' is magnetic direction.
sub property of: GPS Info

PIM Info
type: AnnotationProperty
comment: An attribute relating to print image matching
sub property of: Exif Attribute

UserComment
type: AnnotationProperty
tag number: 37510
comment: A tag for Exif users to write keywords or comments on the image besides those in ImageDescription, and without the character code limitations of the ImageDescription tag. The character code used in the UserComment tag is identified based on an ID code in a fixed 8-byte area at the start of the tag data area.
comment: ユーザーコメント。ImageDescriptionタグ�?��?��?��?��?�?��?�ら�?�JIS2�?イトコード�?Unicode等�?��?�記述�?�許�?�れ�?��?�り�?最�?�?�8�?イト�?�文字コード @ja
sub property of: User Info

Contrast
type: AnnotationProperty
tag number: 41992
comment: The direction of contrast processing applied by the camera when the image was shot.
sub property of: PictTaking

YResolution
type: AnnotationProperty
tag number: 283
comment: The number of pixels per ResolutionUnit in the ImageLength direction. The same value as XResolution is designated.
comment: 画�?�?�表示・�?�刷時�?�垂直解�?度 @ja
sub property of: Image Data Structure
sub property of: Resolution

DateTime
type: AnnotationProperty
tag number: 306
comment: The date and time of image creation. In this standard it is the date and time the file was changed.
comment: �?��?�画�?�?�作�?（�?�る�?��?�最後�?�変更�?�れ�?�）日時。通常�?�DateTimeOrigina�?��?��?�値 @ja
sub property of: Date
sub property of: Exif Attribute

GPSAltitude
type: AnnotationProperty
tag number: 6
comment: The altitude based on the reference in GPSAltitudeRef. Altitude is expressed as one RATIONAL value. The reference unit is meters.
sub property of: Geometric data
sub property of: GPS Info

BrightnessValue
type: AnnotationProperty
tag number: 37379
comment: The value of brightness. The unit is the APEX value. Ordinarily it is given in the range of -99.99 to 99.99. Note that if the numerator of the recorded value is FFFFFFFF.H, Unknown shall be indicated.
comment: 画�?撮影時�?�撮影対象物�?�明る�?�（APEX値）。EV�?��?�る�?��?�ISO感度�?�値を足�?�必�?�?��?�り�?Ev:Exposure, Bv:BrightnessValue, Sv:SensitivityValue�?��?��?�Ev=Bv+Sv Sv=log^2(ISOSpeedRating/3.125)�?��?��?�計算�?を使�?�。ISO感度100�?�場�?�Sv=5�?ISO200�?�場�?�Sv=6�?ISO125�?��?�Sv=5.32 @ja
sub property of: PictTaking

TransferFunction
type: AnnotationProperty
tag number: 301
comment: A transfer function for the image, described in tabular style. Normally this tag is not necessary, since color space is specified in the color space information tag (ColorSpace).
sub property of: Image Data Character

SpectralSensitivity
type: AnnotationProperty
tag number: 34852
comment: Indicates the spectral sensitivity of each channel of the camera used. The tag value is an ASCII string compatible with the standard developed by the ASTM Technical committee.
sub property of: PictTaking

Image Data Structure
type: AnnotationProperty
comment: An attribute relating to image data structure
sub property of: Exif Attribute

WhiteBalance
type: AnnotationProperty
tag number: 41987
comment: The white balance mode set when the image was shot.
comment: ホワイト�?ランス�?�モード @ja
sub property of: PictTaking

StripByteCounts
type: AnnotationProperty
tag number: 279
comment: The total number of bytes in each strip. With JPEG compressed data this designation is not needed and is omitted.
sub property of: Recording Offset

Milimeter
type: AnnotationProperty
comment: A length with unit of mm
sub property of: Length

PrintIM Brightness
type: AnnotationProperty
tag number: 10
comment: Brightness info for print image matching
sub property of: PIM Info

GPSImgDirection
type: AnnotationProperty
tag number: 17
comment: The direction of the image when it was captured. The range of values is from 0.00 to 359.99.
sub property of: GPS Info

GPSSpeed
type: AnnotationProperty
tag number: 13
comment: The speed of GPS receiver movement.
sub property of: GPS Info

Seconds
comment: a mesurement of time length with unit of second

Length
comment: Length of an object. Could be a subProperty of other general schema.

GPSAreaInformation
type: AnnotationProperty
tag number: 28
comment: A character string recording the name of the GPS area. The first byte indicates the character code used, and this is followed by the name of the GPS area.
sub property of: GPS Info

Recording Offset
type: AnnotationProperty
comment: An attribute relating to recording offset
sub property of: Exif Attribute

GPSDestLatitude
type: AnnotationProperty
tag number: 20
comment: Latitude of destination, expressed as three values giving the degrees, minutes, and seconds, respectively.
sub property of: Geometric data
sub property of: GPS Info

Data Type
type: AnnotationProperty
comment: The Exif field data type, such as ascii, byte, short etc.
sub property of: type

DigitalZoomRatio
type: AnnotationProperty
tag number: 41988
comment: The digital zoom ratio when the image was shot. If the numerator of the recorded value is 0, this indicates that digital zoom was not used.
comment: デジタルズーム�?�使�?れ�?�場�?��?�??�?�比率 @ja
sub property of: PictTaking

JPEGInterchangeFormatLength
type: AnnotationProperty
tag number: 514
comment: The number of bytes of JPEG compressed thumbnail data. This is not used for primary image JPEG data.
comment: 圧縮�?�れ�?�サム�?イル�?�サイズ @ja
sub property of: Recording Offset

Artist
type: AnnotationProperty
tag number: 315
comment: Person who created the image
sub property of: creator
sub property of: Exif Attribute

Exif Attribute
type: AnnotationProperty
comment: A property that connects an IFD to one of its entries. Super property which integrates all Exif tags.
domain: IFD

Image Data Character
type: AnnotationProperty
comment: An attribute relating to image data characteristics
sub property of: Exif Attribute

Sharpness
type: AnnotationProperty
tag number: 41994
comment: The direction of sharpness processing applied by the camera when the image was shot.
sub property of: PictTaking

GPSDestBearing
type: AnnotationProperty
tag number: 24
comment: The bearing to the destination point. The range of values is from 0.00 to 359.99.
sub property of: GPS Info

Tag number
type: AnnotationProperty
comment: The Exif tag number
sub property of: identifier

RelatedImageLength
type: AnnotationProperty
tag number: 4098
comment: Related image length
comment: 画�?高。通常�?�サム�?イル画�?�?�Interoperability IFD�?�使�?� @ja
sub property of: Height
sub property of: Interoperability Info

Flash
type: AnnotationProperty
tag number: 37385
comment: The status of flash when the image was shot.
comment: フラッシュ発光�?�状態 @ja
sub property of: PictTaking

Model
type: AnnotationProperty
tag number: 272
comment: Model of image input equipment
comment: カメラ�?�機種�??。DCF�?��?�必須 @ja
sub property of: label
sub property of: Exif Attribute

Orientation
type: AnnotationProperty
tag number: 274
comment: The image orientation viewed in terms of rows and columns.
comment: 画�?データ�?��?��?�(top-left�?��?�）を起点�?��?��?��?�?��?��?��??�?�格�?�?�れ�?��?�る�?� @ja
sub property of: Image Data Structure

PrintIM Sharpness
type: AnnotationProperty
tag number: 13
comment: Sharpness info for print image matching
sub property of: PIM Info

GPSMapDatum
type: AnnotationProperty
tag number: 18
comment: The geodetic survey data used by the GPS receiver. If the survey data is restricted to Japan, the value of this tag is 'TOKYO' or 'WGS-84'. If a GPS Info tag is recorded, it is strongly recommended that this tag be recorded.
comment: 測地系。日本�?�ら'TOKYO'も�?��??�?�'WGS-84' @ja
sub property of: GPS Info

FocalPlaneYResolution
type: AnnotationProperty
tag number: 41487
comment: The number of pixels in the image height (Y) direction per FocalPlaneResolutionUnit on the camera focal plane.
comment: 撮影画�?�?�CCD�?置�?��?�垂直解�?度 @ja
sub property of: PictTaking
sub property of: Resolution

GPSDestDistance
type: AnnotationProperty
tag number: 26
comment: The distance to the destination point.
sub property of: GPS Info

Make
type: AnnotationProperty
tag number: 271
comment: Manufacturer of image input equipment
comment: カメラ�?�メーカー�??。DCF�?��?�必須 @ja
sub property of: label
sub property of: Exif Attribute

GPSTrack
type: AnnotationProperty
tag number: 15
comment: The direction of GPS receiver movement. The range of values is from 0.00 to 359.99.
sub property of: GPS Info

FNumber
type: AnnotationProperty
tag number: 33437
comment: F number
comment: レンズ�?�F値 @ja
sub property of: PictTaking

PictTaking
type: AnnotationProperty
comment: An attribute relating to Picture-Taking Conditions
sub property of: Exif Attribute

ExposureBiasValue
type: AnnotationProperty
tag number: 37380
comment: The exposure bias. The unit is the APEX value. Ordinarily it is given in the range of -99.99 to 99.99.
comment: 撮影時�?�露光補正�?。�?��?�?�APEX値(EV) @ja
sub property of: PictTaking

Exif IFD Pointer
type: AnnotationProperty
tag number: 34665
comment: A pointer to the Exif IFD, which is a set of tags for recording Exif-specific attribute information.
comment: Exif IFD�?��?��?インタ @ja
sub property of: IFD Pointer

Meter
type: AnnotationProperty
comment: A length with unit of meter
sub property of: Length

GPSSatellites
type: AnnotationProperty
tag number: 8
comment: The GPS satellites used for measurements. This tag can be used to describe the number of satellites, their ID number, angle of elevation, azimuth, SNR and other information in ASCII notation. The format is not specified. If the GPS receiver is incapable of taking measurements, value of the tag shall be set to NULL.
sub property of: GPS Info

GPSLatitude
type: AnnotationProperty
tag number: 2
comment: The latitude, expressed as three values giving the degrees, minutes, and seconds, respectively.
comment: 緯度 @ja
sub property of: Geometric data
sub property of: GPS Info

神崎正英
type: Person
type: NamedIndividual

IFD
comment: An Image File Directory

Unknown tag
comment: An Exif tag whose meaning is not known

JEITA CP-3451/EXIF 2.2 Specification
format: PDF

Exif data
comment: An Exif IFD data entry

Subseconds
comment: A tag used to record fractions of seconds for a date property