part_of
type: ObjectProperty
type: TransitiveProperty
has OBO namespace: FlyBase miscellaneous CV
has db xref: OBO_REL:part_of
  type: DbXref
  has URI: http://purl.org/obo/owl/OBO_REL#OBO_REL_part_of

FlyBase CV
type: Class
has OBO namespace: FlyBase miscellaneous CV

death certificate
type: Class
subclass of: publication class
comment: Proforma field: P1.
has OBO namespace: pub_type
in subset: camcur

thermotaxis behavior defective
type: Class
subclass of: behavior defective
comment: Proforma field: GA56. Proforma field: GA28a. Proforma field: GA29a.
has OBO namespace: phenotypic_class
in subset: camcur
has exact synonym: thermotaxis behaviour defective

In transgenic Drosophila (intraspecific)
type: Class
subclass of: In transgenic Drosophila
comment: Proforma field: GA19.
has OBO namespace: mode_of_assay
in subset: camcur
has db xref: abbrev:1
  type: DbXref
  has URI: http://purl.org/obo/owl/abbrev#abbrev_1

Whole-organism transient assay (intraspecific)
type: Class
subclass of: Whole-organism transient assay
comment: Proforma field: GA19.
has OBO namespace: mode_of_assay
in subset: camcur
has db xref: abbrev:2
  type: DbXref
  has URI: http://purl.org/obo/owl/abbrev#abbrev_2

qualifier
type: Class
subclass of: FlyBase CV
has OBO namespace: FlyBase miscellaneous CV

male semi-fertile
type: Class
subclass of: semi-fertile
subclass of: male fertile
comment: Proforma field: GA56. Proforma field: GA28a. Proforma field: GA29a.
has OBO namespace: phenotypic_class
in subset: camcur

female semi-fertile
type: Class
subclass of: semi-fertile
subclass of: female fertile
comment: Proforma field: GA56. Proforma field: GA28a. Proforma field: GA29a.
has OBO namespace: phenotypic_class
in subset: camcur

variegation
type: Class
subclass of: phenotypic class
has OBO namespace: phenotypic_class
in subset: camcur

temporal stage qualifier
type: Class
subclass of: temporal qualifier
has OBO namespace: temporal_qualifier

monophasic
type: Class
subclass of: temporal stage qualifier
comment: Deprecated: Use of this term is discouraged as there is no way to decide how to group anatomy terms combined with this qualifier with other terms in the anatomy ontology. Subject to discussion and once its usage in old curation is removed, this term will be obsoleted. DS
has OBO namespace: temporal_qualifier

relative temporal qualifier
type: Class
subclass of: temporal qualifier
has OBO namespace: temporal_qualifier

absolute temporal qualifier
type: Class
subclass of: temporal qualifier
has OBO namespace: temporal_qualifier

descriptor
type: Class
subclass of: FlyBase CV
has OBO namespace: FlyBase miscellaneous CV

structural qualifier
type: Class
subclass of: phenotype qualifier
has OBO namespace: structural_qualifier

postage stamp
type: Class
subclass of: publication class
comment: Proforma field: P1.
has OBO namespace: pub_type
in subset: camcur

Baylor TE recombination mapping kit stock
type: Class
subclass of: mapping stock
has OBO namespace: FlyBase miscellaneous CV

penetrance qualifier
type: Class
subclass of: qualifier
has OBO namespace: FlyBase miscellaneous CV
has definition: Penetrance is the fraction of individuals of a given genotype who exhibit the phenotype associated with that genotype.
  type: Definition
  has db xref: ISBN:0716735202
    type: DbXref
    has URI: http://purl.org/obo/owl/ISBN#ISBN_0716735202

penetrance complete
type: Class
subclass of: penetrance qualifier
has OBO namespace: FlyBase miscellaneous CV
has definition: Definition
  label: Penetrance is the fraction of individuals of a given genotype who exhibit the phenotype associated with that genotype. Penetrance is complete when all the individuals of a given genotype exhibit the phenotype associated with that genotype.
  has db xref: ISBN:0716735202
    type: DbXref
    has URI: http://purl.org/obo/owl/ISBN#ISBN_0716735202

penetrance incomplete
type: Class
subclass of: penetrance qualifier
has OBO namespace: FlyBase miscellaneous CV
has definition: Definition
  label: Penetrance is the fraction of individuals of a given genotype who exhibit the phenotype associated with that genotype. Penetrance is incomplete when only some the individuals of a given genotype exhibit the phenotype associated with that genotype.
  has db xref: ISBN:0716735202
    type: DbXref
    has URI: http://purl.org/obo/owl/ISBN#ISBN_0716735202

penetrance percent
type: Class
subclass of: penetrance incomplete
comment: This term modifed by a % value.
has OBO namespace: FlyBase miscellaneous CV
has definition: Definition
  label: Penetrance is the fraction of individuals of a given genotype who exhibit the phenotype associated with that genotype. Penetrance is incomplete when only a percentage of the individuals of a given genotype exhibit the phenotype associated with that genotype.
  has db xref: ISBN:0716735202
    type: DbXref
    has URI: http://purl.org/obo/owl/ISBN#ISBN_0716735202

expressivity qualifier
type: Class
subclass of: qualifier
has OBO namespace: FlyBase miscellaneous CV
has definition: Expressivity measures the extent to which a given genotype is expressed at the phenotypic level.
  type: Definition
  has db xref: ISBN:0716735202
    type: DbXref
    has URI: http://purl.org/obo/owl/ISBN#ISBN_0716735202

expressivity complete
type: Class
subclass of: expressivity qualifier
has OBO namespace: FlyBase miscellaneous CV
has definition: Definition
  label: Expressivity measures the extent to which a given genotype is expressed at the phenotypic level. Expressivity is complete when an individual of a given genotype expresses the full phenotype associated with that genotype.
  has db xref: ISBN:0716735202
    type: DbXref
    has URI: http://purl.org/obo/owl/ISBN#ISBN_0716735202

expressivity incomplete
type: Class
subclass of: expressivity qualifier
has OBO namespace: FlyBase miscellaneous CV
has definition: Definition
  label: Expressivity measures the extent to which a given genotype is expressed at the phenotypic level. Expressivity is incomplete when an individual of a given genotype expresses only partially the phenotype associated with that genotype.
  has db xref: ISBN:0716735202
    type: DbXref
    has URI: http://purl.org/obo/owl/ISBN#ISBN_0716735202

expressivity high
type: Class
subclass of: expressivity incomplete
has OBO namespace: FlyBase miscellaneous CV
has definition: Definition
  label: Expressivity measures the extent to which a given genotype is expressed at the phenotypic level. "High expressivity" conveys that while expressivity is not complete, the phenotype expressed is approaching that of complete expressivity.
  has db xref: ISBN:0716735202
    type: DbXref
    has URI: http://purl.org/obo/owl/ISBN#ISBN_0716735202

expressivity low
type: Class
subclass of: expressivity incomplete
has OBO namespace: FlyBase miscellaneous CV
has definition: Definition
  label: Expressivity measures the extent to which a given genotype is expressed at the phenotypic level. "Low expressivity" conveys that phenotype expressed is a much reduced version compared to complete expressivity.
  has db xref: ISBN:0716735202
    type: DbXref
    has URI: http://purl.org/obo/owl/ISBN#ISBN_0716735202

recessive visible allele recombination mapping stock
type: Class
subclass of: visible allele recombination mapping stock
has OBO namespace: FlyBase miscellaneous CV

dominant visible allele recombination mapping stock
type: Class
subclass of: visible allele recombination mapping stock
has OBO namespace: FlyBase miscellaneous CV

SNP recombination mapping stock
type: Class
subclass of: mapping stock
has OBO namespace: FlyBase miscellaneous CV

transposable element mutagenesis stock
type: Class
subclass of: living stock
has OBO namespace: FlyBase miscellaneous CV

compartment
type: Class
subclass of: spatial qualifier
comment: Proforma field: GA17-q. Proforma field: GA28b-q. Proforma field: GA29b-q. Proforma field: GAT6-q. Proforma field: GAP5-q.
has OBO namespace: spatial_qualifier
in subset: camcur

anterior compartment
type: Class
subclass of: compartment
comment: Proforma field: GA17-q. Proforma field: GA28b-q. Proforma field: GA29b-q. Proforma field: GAT6-q. Proforma field: GAP5-q.
has OBO namespace: spatial_qualifier
in subset: camcur
has definition: Restricted to the anterior compartment of some specified type
  type: Definition
  has db xref: FB:DS
    type: DbXref
    has URI: http://purl.org/obo/owl/FB#FB_DS

compartment boundary
type: Class
subclass of: compartment
comment: Proforma field: GA17-q. Proforma field: GA28b-q. Proforma field: GA29b-q. Proforma field: GAT6-q. Proforma field: GAP5-q.
has OBO namespace: spatial_qualifier
in subset: camcur
has definition: Restricted to some compartment boundary within a specified type.
  type: Definition
  has db xref: FB:DS
    type: DbXref
    has URI: http://purl.org/obo/owl/FB#FB_DS

anterior/posterior compartment boundary
type: Class
subclass of: compartment boundary
comment: Proforma field: GA17-q. Proforma field: GA28b-q. Proforma field: GA29b-q. Proforma field: GAT6-q. Proforma field: GAP5-q.
has OBO namespace: spatial_qualifier
in subset: camcur
has definition: Restricted to an anterior/posterior compartment boundary within a specified type.
  type: Definition
  has db xref: FB:DS
    type: DbXref
    has URI: http://purl.org/obo/owl/FB#FB_DS

dorsal/ventral compartment boundary
type: Class
subclass of: compartment boundary
comment: Proforma field: GA17-q. Proforma field: GA28b-q. Proforma field: GA29b-q. Proforma field: GAT6-q. Proforma field: GAP5-q.
has OBO namespace: spatial_qualifier
in subset: camcur

dorsal compartment
type: Class
subclass of: compartment
comment: Proforma field: GA17-q. Proforma field: GA28b-q. Proforma field: GA29b-q. Proforma field: GAT6-q. Proforma field: GAP5-q.
has OBO namespace: spatial_qualifier
in subset: camcur
has definition: Restricted to the dorsal compartment of some specified type.
  type: Definition
  has db xref: FB:DS
    type: DbXref
    has URI: http://purl.org/obo/owl/FB#FB_DS

posterior compartment
type: Class
subclass of: compartment
comment: Proforma field: GA17-q. Proforma field: GA28b-q. Proforma field: GA29b-q. Proforma field: GAT6-q. Proforma field: GAP5-q.
has OBO namespace: spatial_qualifier
in subset: camcur
has definition: Restricted to the posterior compartment of some specified type.
  type: Definition
  has db xref: FB:DS
    type: DbXref
    has URI: http://purl.org/obo/owl/FB#FB_DS

ventral compartment
type: Class
subclass of: compartment
comment: Proforma field: GA17-q. Proforma field: GA28b-q. Proforma field: GA29b-q. Proforma field: GAT6-q. Proforma field: GAP5-q.
has OBO namespace: spatial_qualifier
in subset: camcur
has definition: Restricted to the ventral compartment of some specified type.
  type: Definition
  has db xref: FB:DS
    type: DbXref
    has URI: http://purl.org/obo/owl/FB#FB_DS

relative spatial qualifier
type: Class
subclass of: spatial qualifier
comment: Proforma field: GA17-q. Proforma field: GA28b-q. Proforma field: GA29b-q. Proforma field: GAT6-q. Proforma field: GAP5-q.
has OBO namespace: spatial_qualifier

anterior to
type: Class
subclass of: relative spatial qualifier
comment: Proforma field: GA17-q. Proforma field: GA28b-q. Proforma field: GA29b-q. Proforma field: GAT6-q. Proforma field: GAP5-q.nnDeprecated: Use of this term is discouraged as there is no way to decide how to group anatomy terms combined with this qualifier with other terms in the anatomy ontology. Once its usage in old curation is removed, this term will be obsoleted. DS
has OBO namespace: spatial_qualifier

distal to
type: Class
subclass of: relative spatial qualifier
comment: Proforma field: GA17-q. Proforma field: GA28b-q. Proforma field: GA29b-q. Proforma field: GAT6-q. Proforma field: GAP5-q.nnDeprecated: Use of this term is discouraged as there is no way to decide how to group anatomy terms combined with this qualifier with other terms in the anatomy ontology. Once its usage in old curation is removed, this term will be obsoleted. DS
has OBO namespace: spatial_qualifier

dorsal to
type: Class
subclass of: relative spatial qualifier
comment: Proforma field: GA17-q. Proforma field: GA28b-q. Proforma field: GA29b-q. Proforma field: GAT6-q. Proforma field: GAP5-q.nnDeprecated: Use of this term is discouraged as there is no way to decide how to group anatomy terms combined with this qualifier with other terms in the anatomy ontology. Once its usage in old curation is removed, this term will be obsoleted. DS
has OBO namespace: spatial_qualifier

deficiency kit stock
type: Class
subclass of: ObsoleteClass
has OBO namespace: FlyBase miscellaneous CV
has related synonym: deletion kit stock

transposase source for transposable element mutagenesis
type: Class
subclass of: transposable element mutagenesis stock
has OBO namespace: FlyBase miscellaneous CV

ammunition source for transposable element mutagenesis
type: Class
subclass of: transposable element mutagenesis stock
has OBO namespace: FlyBase miscellaneous CV

posterior to
type: Class
subclass of: relative spatial qualifier
comment: Proforma field: GA17-q. Proforma field: GA28b-q. Proforma field: GA29b-q. Proforma field: GAT6-q. Proforma field: GAP5-q.nnDeprecated: Use of this term is discouraged as there is no way to decide how to group anatomy terms combined with this qualifier with other terms in the anatomy ontology. Once its usage in old curation is removed, this term will be obsoleted. DS
has OBO namespace: spatial_qualifier

precursor
type: Class
subclass of: temporal qualifier
comment: Proforma field: GA17-q. Proforma field: GA28b-q. Proforma field: GA29b-q. Proforma field: GAT6-q. Proforma field: GAP5-q.nnDeprecated: Use of this term is discouraged as there is no way to decide how to group anatomy terms combined with this qualifier with other terms in the anatomy ontology. Once its usage in old curation is removed, this term will be obsoleted. DS
has OBO namespace: temporal_qualifier

proximal to
type: Class
subclass of: relative spatial qualifier
comment: Proforma field: GA17-q. Proforma field: GA28b-q. Proforma field: GA29b-q. Proforma field: GAT6-q. Proforma field: GAP5-q.nnDeprecated: Use of this term is discouraged as there is no way to decide how to group anatomy terms combined with this qualifier with other terms in the anatomy ontology. Once its usage in old curation is removed, this term will be obsoleted. DS
has OBO namespace: spatial_qualifier

surrounding
type: Class
subclass of: relative spatial qualifier
comment: Proforma field: GA17-q. Proforma field: GA28b-q. Proforma field: GA29b-q. Proforma field: GAT6-q. Proforma field: GAP5-q.nnDeprecated: Use of this term is discouraged as there is no way to decide how to group anatomy terms combined with this qualifier with other terms in the anatomy ontology. Once its usage in old curation is removed, this term will be obsoleted. DS
has OBO namespace: spatial_qualifier

ventral to
type: Class
subclass of: relative spatial qualifier
comment: Proforma field: GA17-q. Proforma field: GA28b-q. Proforma field: GA29b-q. Proforma field: GAT6-q. Proforma field: GAP5-q.nnDeprecated: Use of this term is discouraged as there is no way to decide how to group anatomy terms combined with this qualifier with other terms in the anatomy ontology. Once its usage in old curation is removed, this term will be obsoleted. DS
has OBO namespace: spatial_qualifier

vicinity of
type: Class
subclass of: relative spatial qualifier
comment: Proforma field: GA17-q. Proforma field: GA28b-q. Proforma field: GA29b-q. Proforma field: GAT6-q. Proforma field: GAP5-q.nnDeprecated: Use of this term is discouraged as there is no way to decide how to group anatomy terms combined with this qualifier with other terms in the anatomy ontology. Once its usage in old curation is removed, this term will be obsoleted. DS
has OBO namespace: spatial_qualifier

segment boundary
type: Class
subclass of: spatial qualifier
comment: Proforma field: GA17-q. Proforma field: GA28b-q. Proforma field: GA29b-q. Proforma field: GAT6-q. Proforma field: GAP5-q.
has OBO namespace: spatial_qualifier
in subset: camcur

spatial qualifier
type: Class
subclass of: qualifier
comment: Proforma field: GA17-q. Proforma field: GA28b-q. Proforma field: GA29b-q. Proforma field: GAT6-q. Proforma field: GAP5-q.
has OBO namespace: spatial_qualifier

anterior
type: Class
subclass of: spatial qualifier
comment: Proforma field: GA17-q. Proforma field: GA28b-q. Proforma field: GA29b-q. Proforma field: GAT6-q. Proforma field: GAP5-q.
has OBO namespace: spatial_qualifier
in subset: camcur
has definition: Restricted to anterior region of some specified type.
  type: Definition
  has db xref: FB:DS
    type: DbXref
    has URI: http://purl.org/obo/owl/FB#FB_DS

apical
type: Class
subclass of: spatial qualifier
comment: Proforma field: GA17-q. Proforma field: GA28b-q. Proforma field: GA29b-q. Proforma field: GAP6-q. Proforma field: GAT23-q. Proforma field: GAT6-q. Proforma field: GAP5-q.
has OBO namespace: spatial_qualifier
in subset: camcur
has definition: Restricted to apical region of some specified type.
  type: Definition
  has db xref: FB:DS
    type: DbXref
    has URI: http://purl.org/obo/owl/FB#FB_DS

basal
type: Class
subclass of: spatial qualifier
comment: Proforma field: GA17-q. Proforma field: GA28b-q. Proforma field: GA29b-q. Proforma field: GAP6-q. Proforma field: GAT23-q. Proforma field: GAT6-q. Proforma field: GAP5-q.
has OBO namespace: spatial_qualifier
in subset: camcur
has definition: Restricted to basal region of some specified type.
  type: Definition
  has db xref: FB:DS
    type: DbXref
    has URI: http://purl.org/obo/owl/FB#FB_DS

central
type: Class
subclass of: spatial qualifier
comment: Proforma field: GA17-q. Proforma field: GA28b-q. Proforma field: GA29b-q. Proforma field: GAT6-q. Proforma field: GAP5-q.
has OBO namespace: spatial_qualifier
in subset: camcur
has definition: Restricted to central region of some specified type.
  type: Definition
  has db xref: FB:DS
    type: DbXref
    has URI: http://purl.org/obo/owl/FB#FB_DS

contralateral
type: Class
subclass of: spatial qualifier
comment: Proforma field: GA17-q. Proforma field: GA28b-q. Proforma field: GA29b-q. Proforma field: GAT6-q. Proforma field: GAP5-q.nnDeprecated: Contralateral means - on the oppsoite side from .... In curation usage: on the oppsoite side froms what ? Will be obsoleted once a replacement term agreed upon (if needed) and any old usage retrofitted. DS
has OBO namespace: spatial_qualifier

distal
type: Class
subclass of: spatial qualifier
comment: Proforma field: GA17-q. Proforma field: GA28b-q. Proforma field: GA29b-q. Proforma field: GAT6-q. Proforma field: GAP5-q.
has OBO namespace: spatial_qualifier
in subset: camcur
has definition: Restricted to distsal region of some specified type.
  type: Definition
  has db xref: FB:DS
    type: DbXref
    has URI: http://purl.org/obo/owl/FB#FB_DS

dorsal
type: Class
subclass of: spatial qualifier
comment: Proforma field: GA17-q. Proforma field: GA28b-q. Proforma field: GA29b-q. Proforma field: GAT6-q. Proforma field: GAP5-q.
has OBO namespace: spatial_qualifier
in subset: camcur
has definition: Restricted to dorsal region of some specified type.
  type: Definition
  has db xref: FB:DS
    type: DbXref
    has URI: http://purl.org/obo/owl/FB#FB_DS

dorso-lateral
type: Class
subclass of: spatial qualifier
comment: Proforma field: GA17-q. Proforma field: GA28b-q. Proforma field: GA29b-q. Proforma field: GAT6-q. Proforma field: GAP5-q.
has OBO namespace: spatial_qualifier
in subset: camcur
has definition: Restricted to dorso-lateral region of some specified type.
  type: Definition
  has db xref: FB:DS
    type: DbXref
    has URI: http://purl.org/obo/owl/FB#FB_DS

ectopic
type: Class
subclass of: structural qualifier
comment: Proforma field: GA17-q. Proforma field: GA28b-q. Proforma field: GA29b-q. Proforma field: GAT6-q. Proforma field: GAP5-q.
has OBO namespace: structural_qualifier
in subset: camcur

ipsilateral
type: Class
subclass of: spatial qualifier
comment: Proforma field: GA17-q. Proforma field: GA28b-q. Proforma field: GA29b-q. Proforma field: GAT6-q. Proforma field: GAP5-q.nnDeprecated: As far as I can tell, ipsilateral means - on the same side as .... In curation usage: on the same side as what ? Will be obsoleted once a replacement term agreed upon (if needed) and any old usage retrofitted. DS
has OBO namespace: spatial_qualifier

lateral
type: Class
subclass of: spatial qualifier
comment: Proforma field: GA17-q. Proforma field: GA28b-q. Proforma field: GA29b-q. Proforma field: GAP6-q. Proforma field: GAT23-q. Proforma field: GAT6-q. Proforma field: GAP5-q.
has OBO namespace: spatial_qualifier
in subset: camcur
has definition: Restricted to lateral region(s) of some specified type.
  type: Definition
  has db xref: FB:DS
    type: DbXref
    has URI: http://purl.org/obo/owl/FB#FB_DS

medial
type: Class
subclass of: spatial qualifier
comment: Proforma field: GA17-q. Proforma field: GA28b-q. Proforma field: GA29b-q. Proforma field: GAT6-q. Proforma field: GAP5-q.
has OBO namespace: spatial_qualifier
in subset: camcur
has definition: Restricted to medial region of some specified type.
  type: Definition
  has db xref: FB:DS
    type: DbXref
    has URI: http://purl.org/obo/owl/FB#FB_DS

posterior
type: Class
subclass of: spatial qualifier
comment: Proforma field: GA56-q. Proforma field: GA28a-q. Proforma field: GA29a-q. Proforma field: GA17-q. Proforma field: GA28b-q. Proforma field: GA29b-q. Proforma field: GAT6-q. Proforma field: GAP5-q.
has OBO namespace: spatial_qualifier
in subset: camcur
has definition: Restricted to posterior region of some specified type.
  type: Definition
  has db xref: FB:DS
    type: DbXref
    has URI: http://purl.org/obo/owl/FB#FB_DS

proximal
type: Class
subclass of: spatial qualifier
comment: Proforma field: GA17-q. Proforma field: GA28b-q. Proforma field: GA29b-q. Proforma field: GAT6-q. Proforma field: GAP5-q.
has OBO namespace: spatial_qualifier
in subset: camcur
has definition: Restricted to proximal region of some specified type.
  type: Definition
  has db xref: FB:DS
    type: DbXref
    has URI: http://purl.org/obo/owl/FB#FB_DS

restricted
type: Class
subclass of: spatial qualifier
comment: Proforma field: GA17-q. Proforma field: GA28b-q. Proforma field: GA29b-q. Proforma field: GAT6-q. Proforma field: GAP5-q.
has OBO namespace: spatial_qualifier
in subset: camcur
has definition: Restricted to unknown part(s) of a specified type.
  type: Definition
  has db xref: FB:DS
    type: DbXref
    has URI: http://purl.org/obo/owl/FB#FB_DS

supernumerary
type: Class
subclass of: structural qualifier
comment: Proforma field: GA17-q. Proforma field: GA28b-q. Proforma field: GA29b-q. Proforma field: GAT6-q. Proforma field: GAP5-q.
has OBO namespace: structural_qualifier
in subset: camcur

ubiquitous
type: Class
subclass of: spatial qualifier
comment: Proforma field: GA17-q. Proforma field: GA28b-q. Proforma field: GA29b-q. Proforma field: GAT6-q. Proforma field: GAP5-q.
has OBO namespace: spatial_qualifier
in subset: camcur

ventral
type: Class
subclass of: spatial qualifier
comment: Proforma field: GA17-q. Proforma field: GA28b-q. Proforma field: GA29b-q. Proforma field: GAT6-q. Proforma field: GAP5-q.
has OBO namespace: spatial_qualifier
in subset: camcur
has definition: Restricted to ventral region of some specified type.
  type: Definition
  has db xref: FB:DS
    type: DbXref
    has URI: http://purl.org/obo/owl/FB#FB_DS

ventro-lateral
type: Class
subclass of: spatial qualifier
comment: Proforma field: GA17-q. Proforma field: GA28b-q. Proforma field: GA29b-q. Proforma field: GAT6-q. Proforma field: GAP5-q.
has OBO namespace: spatial_qualifier
in subset: camcur
has definition: Restricted to ventro-lateral region of some specified type.
  type: Definition
  has db xref: FB:DS
    type: DbXref
    has URI: http://purl.org/obo/owl/FB#FB_DS

gene expression qualifier
type: Class
subclass of: ObsoleteClass
has OBO namespace: FlyBase miscellaneous CV

embryonic expression pattern
type: Class
subclass of: ObsoleteClass
comment: Proforma field: GA17-q. Proforma field: GA28b-q. Proforma field: GA29b-q. Proforma field: GAT6-q. Proforma field: GAP5-q.
has OBO namespace: FlyBase miscellaneous CV

egg length
type: Class
subclass of: spatial qualifier
comment: Proforma field: GA17-q. Proforma field: GA28b-q. Proforma field: GA29b-q. Proforma field: GAT6-q. Proforma field: GAP5-q.
has OBO namespace: spatial_qualifier
in subset: camcur
has definition: Position in the the egg or pre-gastrula embryo expressed as a percentage of egg length, were 0% corresponds to the posterior tip and 100% to the anterior tip.
  type: Definition
  has db xref: FB:ds
    type: DbXref
    has URI: http://purl.org/obo/owl/FB#FB_ds

0% egg length
type: Class
subclass of: egg length
comment: Proforma field: GA17-q. Proforma field: GA28b-q. Proforma field: GA29b-q. Proforma field: GAT6-q. Proforma field: GAP5-q.
has OBO namespace: spatial_qualifier
in subset: camcur
has definition: At the posterior tip of the egg or pre-gastrula embryo.
  type: Definition
  has db xref: FB:ds
    type: DbXref
    has URI: http://purl.org/obo/owl/FB#FB_ds

0-10% egg length
type: Class
subclass of: egg length
comment: Proforma field: GA17-q. Proforma field: GA28b-q. Proforma field: GA29b-q. Proforma field: GAT6-q. Proforma field: GAP5-q.
has OBO namespace: spatial_qualifier
in subset: camcur
has definition: 0-10% of egg length from the posterior tip of the egg or pre-gastrula embryo.
  type: Definition
  has db xref: FB:ds
    type: DbXref
    has URI: http://purl.org/obo/owl/FB#FB_ds

0-100% egg length
type: Class
subclass of: egg length
comment: Proforma field: GA17-q. Proforma field: GA28b-q. Proforma field: GA29b-q. Proforma field: GAT6-q. Proforma field: GAP5-q.
has OBO namespace: spatial_qualifier
in subset: camcur
has definition: The full length of the or pre-gastrula embryo.
  type: Definition
  has db xref: FB:ds
    type: DbXref
    has URI: http://purl.org/obo/owl/FB#FB_ds

0-20% egg length
type: Class
subclass of: egg length
comment: Proforma field: GA17-q. Proforma field: GA28b-q. Proforma field: GA29b-q. Proforma field: GAT6-q. Proforma field: GAP5-q.
has OBO namespace: spatial_qualifier
in subset: camcur
has definition: 0-20% of egg length from the posterior tip of the egg or pre-gastrula embryo.
  type: Definition
  has db xref: FB:ds
    type: DbXref
    has URI: http://purl.org/obo/owl/FB#FB_ds

0-30% egg length
type: Class
subclass of: egg length
comment: Proforma field: GA17-q. Proforma field: GA28b-q. Proforma field: GA29b-q. Proforma field: GAT6-q. Proforma field: GAP5-q.
has OBO namespace: spatial_qualifier
in subset: camcur
has definition: 0-30% of egg length from the posterior tip of the egg or pre-gastrula embryo.
  type: Definition
  has db xref: FB:ds
    type: DbXref
    has URI: http://purl.org/obo/owl/FB#FB_ds

0-40% egg length
type: Class
subclass of: egg length
comment: Proforma field: GA17-q. Proforma field: GA28b-q. Proforma field: GA29b-q. Proforma field: GAT6-q. Proforma field: GAP5-q.
has OBO namespace: spatial_qualifier
in subset: camcur
has definition: 0-40% of egg length from the posterior tip of the egg or pre-gastrula embryo.
  type: Definition
  has db xref: FB:ds
    type: DbXref
    has URI: http://purl.org/obo/owl/FB#FB_ds

0-50% egg length
type: Class
subclass of: egg length
comment: Proforma field: GA17-q. Proforma field: GA28b-q. Proforma field: GA29b-q. Proforma field: GAT6-q. Proforma field: GAP5-q.
has OBO namespace: spatial_qualifier
in subset: camcur
has definition: 0-50% of egg length from the posterior tip of the egg or pre-gastrula embryo.
  type: Definition
  has db xref: FB:ds
    type: DbXref
    has URI: http://purl.org/obo/owl/FB#FB_ds

0-60% egg length
type: Class
subclass of: egg length
comment: Proforma field: GA17-q. Proforma field: GA28b-q. Proforma field: GA29b-q. Proforma field: GAT6-q. Proforma field: GAP5-q.
has OBO namespace: spatial_qualifier
in subset: camcur
has definition: 0-60% of egg length from the posterior tip of the egg or pre-gastrula embryo.
  type: Definition
  has db xref: FB:ds
    type: DbXref
    has URI: http://purl.org/obo/owl/FB#FB_ds

0-70% egg length
type: Class
subclass of: egg length
comment: Proforma field: GA17-q. Proforma field: GA28b-q. Proforma field: GA29b-q. Proforma field: GAT6-q. Proforma field: GAP5-q.
has OBO namespace: spatial_qualifier
in subset: camcur
has definition: 0-70% of egg length from the posterior tip of the egg or pre-gastrula embryo.
  type: Definition
  has db xref: FB:ds
    type: DbXref
    has URI: http://purl.org/obo/owl/FB#FB_ds

0-80% egg length
type: Class
subclass of: egg length
comment: Proforma field: GA17-q. Proforma field: GA28b-q. Proforma field: GA29b-q. Proforma field: GAT6-q. Proforma field: GAP5-q.
has OBO namespace: spatial_qualifier
in subset: camcur
has definition: 0-80% of egg length from the posterior tip of the egg or pre-gastrula embryo.
  type: Definition
  has db xref: FB:ds
    type: DbXref
    has URI: http://purl.org/obo/owl/FB#FB_ds

0-90% egg length
type: Class
subclass of: egg length
comment: Proforma field: GA17-q. Proforma field: GA28b-q. Proforma field: GA29b-q. Proforma field: GAT6-q. Proforma field: GAP5-q.
has OBO namespace: spatial_qualifier
in subset: camcur
has definition: 0-90% of egg length from the posterior tip of the egg or pre-gastrula embryo.
  type: Definition
  has db xref: FB:ds
    type: DbXref
    has URI: http://purl.org/obo/owl/FB#FB_ds

10% egg length
type: Class
subclass of: egg length
comment: Proforma field: GA17-q. Proforma field: GA28b-q. Proforma field: GA29b-q. Proforma field: GAT6-q. Proforma field: GAP5-q.
has OBO namespace: spatial_qualifier
in subset: camcur
has definition: 10% of egg length from the posterior tip of the egg or pre-gastrula embryo.
  type: Definition
  has db xref: FB:ds
    type: DbXref
    has URI: http://purl.org/obo/owl/FB#FB_ds

10-100% egg length
type: Class
subclass of: egg length
comment: Proforma field: GA17-q. Proforma field: GA28b-q. Proforma field: GA29b-q. Proforma field: GAT6-q. Proforma field: GAP5-q.
has OBO namespace: spatial_qualifier
in subset: camcur
has definition: 10-100% of egg length from the posterior tip (0%) of the egg or pre-gastrula embryo.
  type: Definition
  has db xref: FB:ds
    type: DbXref
    has URI: http://purl.org/obo/owl/FB#FB_ds

10-20% egg length
type: Class
subclass of: egg length
comment: Proforma field: GA17-q. Proforma field: GA28b-q. Proforma field: GA29b-q. Proforma field: GAT6-q. Proforma field: GAP5-q.
has OBO namespace: spatial_qualifier
in subset: camcur
has definition: 10-20% of egg length from the posterior tip (0%) of the egg or pre-gastrula embryo.
  type: Definition
  has db xref: FB:ds
    type: DbXref
    has URI: http://purl.org/obo/owl/FB#FB_ds

10-30% egg length
type: Class
subclass of: egg length
comment: Proforma field: GA17-q. Proforma field: GA28b-q. Proforma field: GA29b-q. Proforma field: GAT6-q. Proforma field: GAP5-q.
has OBO namespace: spatial_qualifier
in subset: camcur
has definition: 10-30% of egg length from the posterior tip (0%) of the egg or pre-gastrula embryo.
  type: Definition
  has db xref: FB:ds
    type: DbXref
    has URI: http://purl.org/obo/owl/FB#FB_ds

10-40% egg length
type: Class
subclass of: egg length
comment: Proforma field: GA17-q. Proforma field: GA28b-q. Proforma field: GA29b-q. Proforma field: GAT6-q. Proforma field: GAP5-q.
has OBO namespace: spatial_qualifier
in subset: camcur
has definition: 10-40% of egg length from the posterior tip (0%) of the egg or pre-gastrula embryo.
  type: Definition
  has db xref: FB:ds
    type: DbXref
    has URI: http://purl.org/obo/owl/FB#FB_ds

10-50% egg length
type: Class
subclass of: egg length
comment: Proforma field: GA17-q. Proforma field: GA28b-q. Proforma field: GA29b-q. Proforma field: GAT6-q. Proforma field: GAP5-q.
has OBO namespace: spatial_qualifier
in subset: camcur
has definition: 10-50% of egg length from the posterior tip (0%) of the egg or pre-gastrula embryo.
  type: Definition
  has db xref: FB:ds
    type: DbXref
    has URI: http://purl.org/obo/owl/FB#FB_ds

10-60% egg length
type: Class
subclass of: egg length
comment: Proforma field: GA17-q. Proforma field: GA28b-q. Proforma field: GA29b-q. Proforma field: GAT6-q. Proforma field: GAP5-q.
has OBO namespace: spatial_qualifier
in subset: camcur
has definition: 10-60% of egg length from the posterior tip (0%) of the egg or pre-gastrula embryo.
  type: Definition
  has db xref: FB:ds
    type: DbXref
    has URI: http://purl.org/obo/owl/FB#FB_ds

10-70% egg length
type: Class
subclass of: egg length
comment: Proforma field: GA17-q. Proforma field: GA28b-q. Proforma field: GA29b-q. Proforma field: GAT6-q. Proforma field: GAP5-q.
has OBO namespace: spatial_qualifier
in subset: camcur
has definition: 10-70% of egg length from the posterior tip (0%) of the egg or pre-gastrula embryo.
  type: Definition
  has db xref: FB:ds
    type: DbXref
    has URI: http://purl.org/obo/owl/FB#FB_ds

10-80% egg length
type: Class
subclass of: egg length
comment: Proforma field: GA17-q. Proforma field: GA28b-q. Proforma field: GA29b-q. Proforma field: GAT6-q. Proforma field: GAP5-q.
has OBO namespace: spatial_qualifier
in subset: camcur
has definition: 10-80% of egg length from the posterior tip (0%) of the egg or pre-gastrula embryo.
  type: Definition
  has db xref: FB:ds
    type: DbXref
    has URI: http://purl.org/obo/owl/FB#FB_ds

10-90% egg length
type: Class
subclass of: egg length
comment: Proforma field: GA17-q. Proforma field: GA28b-q. Proforma field: GA29b-q. Proforma field: GAT6-q. Proforma field: GAP5-q.
has OBO namespace: spatial_qualifier
in subset: camcur
has definition: 10-90% of egg length from the posterior tip (0%) of the egg or pre-gastrula embryo.
  type: Definition
  has db xref: FB:ds
    type: DbXref
    has URI: http://purl.org/obo/owl/FB#FB_ds

100% egg length
type: Class
subclass of: egg length
comment: Proforma field: GA17-q. Proforma field: GA28b-q. Proforma field: GA29b-q. Proforma field: GAT6-q. Proforma field: GAP5-q.
has OBO namespace: spatial_qualifier
in subset: camcur
has definition: At the anterior tip of the egg or pre-gastrula embryo.
  type: Definition
  has db xref: FB:ds
    type: DbXref
    has URI: http://purl.org/obo/owl/FB#FB_ds

20% egg length
type: Class
subclass of: egg length
comment: Proforma field: GA17-q. Proforma field: GA28b-q. Proforma field: GA29b-q. Proforma field: GAT6-q. Proforma field: GAP5-q.
has OBO namespace: spatial_qualifier
in subset: camcur
has definition: 10% of egg length from the posterior tip of the egg or pre-gastrula embryo.
  type: Definition
  has db xref: FB:ds
    type: DbXref
    has URI: http://purl.org/obo/owl/FB#FB_ds

20-100% egg length
type: Class
subclass of: egg length
comment: Proforma field: GA17-q. Proforma field: GA28b-q. Proforma field: GA29b-q. Proforma field: GAT6-q. Proforma field: GAP5-q.
has OBO namespace: spatial_qualifier
in subset: camcur
has definition: 20-100% of egg length from the posterior tip (0%) of the egg or pre-gastrula embryo.
  type: Definition
  has db xref: FB:ds
    type: DbXref
    has URI: http://purl.org/obo/owl/FB#FB_ds

20-30% egg length
type: Class
subclass of: egg length
comment: Proforma field: GA17-q. Proforma field: GA28b-q. Proforma field: GA29b-q. Proforma field: GAT6-q. Proforma field: GAP5-q.
has OBO namespace: spatial_qualifier
in subset: camcur
has definition: 20-30% of egg length from the posterior tip (0%) of the egg or pre-gastrula embryo.
  type: Definition
  has db xref: FB:ds
    type: DbXref
    has URI: http://purl.org/obo/owl/FB#FB_ds

20-40% egg length
type: Class
subclass of: egg length
comment: Proforma field: GA17-q. Proforma field: GA28b-q. Proforma field: GA29b-q. Proforma field: GAT6-q. Proforma field: GAP5-q.
has OBO namespace: spatial_qualifier
in subset: camcur
has definition: 20-40% of egg length from the posterior tip (0%) of the egg or pre-gastrula embryo.
  type: Definition
  has db xref: FB:ds
    type: DbXref
    has URI: http://purl.org/obo/owl/FB#FB_ds

20-50% egg length
type: Class
subclass of: egg length
comment: Proforma field: GA17-q. Proforma field: GA28b-q. Proforma field: GA29b-q. Proforma field: GAT6-q. Proforma field: GAP5-q.
has OBO namespace: spatial_qualifier
in subset: camcur
has definition: 20-50% of egg length from the posterior tip (0%) of the egg or pre-gastrula embryo.
  type: Definition
  has db xref: FB:ds
    type: DbXref
    has URI: http://purl.org/obo/owl/FB#FB_ds

20-60% egg length
type: Class
subclass of: egg length
comment: Proforma field: GA17-q. Proforma field: GA28b-q. Proforma field: GA29b-q. Proforma field: GAT6-q. Proforma field: GAP5-q.
has OBO namespace: spatial_qualifier
in subset: camcur
has definition: 20-60% of egg length from the posterior tip (0%) of the egg or pre-gastrula embryo.
  type: Definition
  has db xref: FB:ds
    type: DbXref
    has URI: http://purl.org/obo/owl/FB#FB_ds

20-70% egg length
type: Class
subclass of: egg length
comment: Proforma field: GA17-q. Proforma field: GA28b-q. Proforma field: GA29b-q. Proforma field: GAT6-q. Proforma field: GAP5-q.
has OBO namespace: spatial_qualifier
in subset: camcur
has definition: 20-70% of egg length from the posterior tip (0%) of the egg or pre-gastrula embryo.
  type: Definition
  has db xref: FB:ds
    type: DbXref
    has URI: http://purl.org/obo/owl/FB#FB_ds

20-80% egg length
type: Class
subclass of: egg length
comment: Proforma field: GA17-q. Proforma field: GA28b-q. Proforma field: GA29b-q. Proforma field: GAT6-q. Proforma field: GAP5-q.
has OBO namespace: spatial_qualifier
in subset: camcur
has definition: 20-80% of egg length from the posterior tip (0%) of the egg or pre-gastrula embryo.
  type: Definition
  has db xref: FB:ds
    type: DbXref
    has URI: http://purl.org/obo/owl/FB#FB_ds

20-90% egg length
type: Class
subclass of: egg length
comment: Proforma field: GA17-q. Proforma field: GA28b-q. Proforma field: GA29b-q. Proforma field: GAT6-q. Proforma field: GAP5-q.
has OBO namespace: spatial_qualifier
in subset: camcur
has definition: 20-90% of egg length from the posterior tip (0%) of the egg or pre-gastrula embryo.
  type: Definition
  has db xref: FB:ds
    type: DbXref
    has URI: http://purl.org/obo/owl/FB#FB_ds

30% egg length
type: Class
subclass of: egg length
comment: Proforma field: GA17-q. Proforma field: GA28b-q. Proforma field: GA29b-q. Proforma field: GAT6-q. Proforma field: GAP5-q.
has OBO namespace: spatial_qualifier
in subset: camcur
has definition: 30% of egg length from the posterior tip of the egg or pre-gastrula embryo.
  type: Definition
  has db xref: FB:ds
    type: DbXref
    has URI: http://purl.org/obo/owl/FB#FB_ds

30-100% egg length
type: Class
subclass of: egg length
comment: Proforma field: GA17-q. Proforma field: GA28b-q. Proforma field: GA29b-q. Proforma field: GAT6-q. Proforma field: GAP5-q.
has OBO namespace: spatial_qualifier
in subset: camcur
has definition: 30-100% of egg length from the posterior tip (0%) of the egg or pre-gastrula embryo.
  type: Definition
  has db xref: FB:ds
    type: DbXref
    has URI: http://purl.org/obo/owl/FB#FB_ds

30-40% egg length
type: Class
subclass of: egg length
comment: Proforma field: GA17-q. Proforma field: GA28b-q. Proforma field: GA29b-q. Proforma field: GAT6-q. Proforma field: GAP5-q.
has OBO namespace: spatial_qualifier
in subset: camcur
has definition: 30-40% of egg length from the posterior tip (0%) of the egg or pre-gastrula embryo.
  type: Definition
  has db xref: FB:ds
    type: DbXref
    has URI: http://purl.org/obo/owl/FB#FB_ds

30-50% egg length
type: Class
subclass of: egg length
comment: Proforma field: GA17-q. Proforma field: GA28b-q. Proforma field: GA29b-q. Proforma field: GAT6-q. Proforma field: GAP5-q.
has OBO namespace: spatial_qualifier
in subset: camcur
has definition: 30-50% of egg length from the posterior tip (0%) of the egg or pre-gastrula embryo.
  type: Definition
  has db xref: FB:ds
    type: DbXref
    has URI: http://purl.org/obo/owl/FB#FB_ds

30-60% egg length
type: Class
subclass of: egg length
comment: Proforma field: GA17-q. Proforma field: GA28b-q. Proforma field: GA29b-q. Proforma field: GAT6-q. Proforma field: GAP5-q.
has OBO namespace: spatial_qualifier
in subset: camcur
has definition: 30-60% of egg length from the posterior tip (0%) of the egg or pre-gastrula embryo.
  type: Definition
  has db xref: FB:ds
    type: DbXref
    has URI: http://purl.org/obo/owl/FB#FB_ds

30-70% egg length
type: Class
subclass of: egg length
comment: Proforma field: GA17-q. Proforma field: GA28b-q. Proforma field: GA29b-q. Proforma field: GAT6-q. Proforma field: GAP5-q.
has OBO namespace: spatial_qualifier
in subset: camcur
has definition: 30-70% of egg length from the posterior tip (0%) of the egg or pre-gastrula embryo.
  type: Definition
  has db xref: FB:ds
    type: DbXref
    has URI: http://purl.org/obo/owl/FB#FB_ds

30-80% egg length
type: Class
subclass of: egg length
comment: Proforma field: GA17-q. Proforma field: GA28b-q. Proforma field: GA29b-q. Proforma field: GAT6-q. Proforma field: GAP5-q.
has OBO namespace: spatial_qualifier
in subset: camcur
has definition: 30-80% of egg length from the posterior tip (0%) of the egg or pre-gastrula embryo.
  type: Definition
  has db xref: FB:ds
    type: DbXref
    has URI: http://purl.org/obo/owl/FB#FB_ds

30-90% egg length
type: Class
subclass of: egg length
comment: Proforma field: GA17-q. Proforma field: GA28b-q. Proforma field: GA29b-q. Proforma field: GAT6-q. Proforma field: GAP5-q.
has OBO namespace: spatial_qualifier
in subset: camcur
has definition: 30-90% of egg length from the posterior tip (0%) of the egg or pre-gastrula embryo.
  type: Definition
  has db xref: FB:ds
    type: DbXref
    has URI: http://purl.org/obo/owl/FB#FB_ds

40% egg length
type: Class
subclass of: egg length
comment: Proforma field: GA17-q. Proforma field: GA28b-q. Proforma field: GA29b-q. Proforma field: GAT6-q. Proforma field: GAP5-q.
has OBO namespace: spatial_qualifier
in subset: camcur
has definition: 40% of egg length from the posterior tip of the egg or pre-gastrula embryo.
  type: Definition
  has db xref: FB:ds
    type: DbXref
    has URI: http://purl.org/obo/owl/FB#FB_ds

40-100% egg length
type: Class
subclass of: egg length
comment: Proforma field: GA17-q. Proforma field: GA28b-q. Proforma field: GA29b-q. Proforma field: GAT6-q. Proforma field: GAP5-q.
has OBO namespace: spatial_qualifier
in subset: camcur
has definition: 40-100% of egg length from the posterior tip (0%) of the egg or pre-gastrula embryo.
  type: Definition
  has db xref: FB:ds
    type: DbXref
    has URI: http://purl.org/obo/owl/FB#FB_ds

40-50% egg length
type: Class
subclass of: egg length
comment: Proforma field: GA17-q. Proforma field: GA28b-q. Proforma field: GA29b-q. Proforma field: GAT6-q. Proforma field: GAP5-q.
has OBO namespace: spatial_qualifier
in subset: camcur
has definition: 40-50% of egg length from the posterior tip (0%) of the egg or pre-gastrula embryo.
  type: Definition
  has db xref: FB:ds
    type: DbXref
    has URI: http://purl.org/obo/owl/FB#FB_ds

40-60% egg length
type: Class
subclass of: egg length
comment: Proforma field: GA17-q. Proforma field: GA28b-q. Proforma field: GA29b-q. Proforma field: GAT6-q. Proforma field: GAP5-q.
has OBO namespace: spatial_qualifier
in subset: camcur
has definition: 40-60% of egg length from the posterior tip (0%) of the egg or pre-gastrula embryo.
  type: Definition
  has db xref: FB:ds
    type: DbXref
    has URI: http://purl.org/obo/owl/FB#FB_ds

40-70% egg length
type: Class
subclass of: egg length
comment: Proforma field: GA17-q. Proforma field: GA28b-q. Proforma field: GA29b-q. Proforma field: GAT6-q. Proforma field: GAP5-q.
has OBO namespace: spatial_qualifier
in subset: camcur
has definition: 40-70% of egg length from the posterior tip (0%) of the egg or pre-gastrula embryo.
  type: Definition
  has db xref: FB:ds
    type: DbXref
    has URI: http://purl.org/obo/owl/FB#FB_ds

40-80% egg length
type: Class
subclass of: egg length
comment: Proforma field: GA17-q. Proforma field: GA28b-q. Proforma field: GA29b-q. Proforma field: GAT6-q. Proforma field: GAP5-q.
has OBO namespace: spatial_qualifier
in subset: camcur
has definition: 40-80% of egg length from the posterior tip (0%) of the egg or pre-gastrula embryo.
  type: Definition
  has db xref: FB:ds
    type: DbXref
    has URI: http://purl.org/obo/owl/FB#FB_ds

40-90% egg length
type: Class
subclass of: egg length
comment: Proforma field: GA17-q. Proforma field: GA28b-q. Proforma field: GA29b-q. Proforma field: GAT6-q. Proforma field: GAP5-q.
has OBO namespace: spatial_qualifier
in subset: camcur
has definition: 40-90% of egg length from the posterior tip (0%) of the egg or pre-gastrula embryo.
  type: Definition
  has db xref: FB:ds
    type: DbXref
    has URI: http://purl.org/obo/owl/FB#FB_ds

50% egg length
type: Class
subclass of: egg length
comment: Proforma field: GA17-q. Proforma field: GA28b-q. Proforma field: GA29b-q. Proforma field: GAT6-q. Proforma field: GAP5-q.
has OBO namespace: spatial_qualifier
in subset: camcur
has definition: 50% of egg length from the posterior tip of the egg or pre-gastrula embryo.
  type: Definition
  has db xref: FB:ds
    type: DbXref
    has URI: http://purl.org/obo/owl/FB#FB_ds

50-100% egg length
type: Class
subclass of: egg length
comment: Proforma field: GA17-q. Proforma field: GA28b-q. Proforma field: GA29b-q. Proforma field: GAT6-q. Proforma field: GAP5-q.
has OBO namespace: spatial_qualifier
in subset: camcur
has definition: 50-100% of egg length from the posterior tip (0%) of the egg or pre-gastrula embryo.
  type: Definition
  has db xref: FB:ds
    type: DbXref
    has URI: http://purl.org/obo/owl/FB#FB_ds

50-60% egg length
type: Class
subclass of: egg length
comment: Proforma field: GA17-q. Proforma field: GA28b-q. Proforma field: GA29b-q. Proforma field: GAT6-q. Proforma field: GAP5-q.
has OBO namespace: spatial_qualifier
in subset: camcur
has definition: 50-60% of egg length from the posterior tip (0%) of the egg or pre-gastrula embryo.
  type: Definition
  has db xref: FB:ds
    type: DbXref
    has URI: http://purl.org/obo/owl/FB#FB_ds

50-70% egg length
type: Class
subclass of: egg length
comment: Proforma field: GA17-q. Proforma field: GA28b-q. Proforma field: GA29b-q. Proforma field: GAT6-q. Proforma field: GAP5-q.
has OBO namespace: spatial_qualifier
in subset: camcur
has definition: 50-70% of egg length from the posterior tip (0%) of the egg or pre-gastrula embryo.
  type: Definition
  has db xref: FB:ds
    type: DbXref
    has URI: http://purl.org/obo/owl/FB#FB_ds

50-80% egg length
type: Class
subclass of: egg length
comment: Proforma field: GA17-q. Proforma field: GA28b-q. Proforma field: GA29b-q. Proforma field: GAT6-q. Proforma field: GAP5-q.
has OBO namespace: spatial_qualifier
in subset: camcur
has definition: 50-80% of egg length from the posterior tip (0%) of the egg or pre-gastrula embryo.
  type: Definition
  has db xref: FB:ds
    type: DbXref
    has URI: http://purl.org/obo/owl/FB#FB_ds

50-90% egg length
type: Class
subclass of: egg length
comment: Proforma field: GA17-q. Proforma field: GA28b-q. Proforma field: GA29b-q. Proforma field: GAT6-q. Proforma field: GAP5-q.
has OBO namespace: spatial_qualifier
in subset: camcur
has definition: 50-90% of egg length from the posterior tip (0%) of the egg or pre-gastrula embryo.
  type: Definition
  has db xref: FB:ds
    type: DbXref
    has URI: http://purl.org/obo/owl/FB#FB_ds

60% egg length
type: Class
subclass of: egg length
comment: Proforma field: GA17-q. Proforma field: GA28b-q. Proforma field: GA29b-q. Proforma field: GAT6-q. Proforma field: GAP5-q.
has OBO namespace: spatial_qualifier
in subset: camcur
has definition: 60% of egg length from the posterior tip of the egg or pre-gastrula embryo.
  type: Definition
  has db xref: FB:ds
    type: DbXref
    has URI: http://purl.org/obo/owl/FB#FB_ds

60-100% egg length
type: Class
subclass of: egg length
comment: Proforma field: GA17-q. Proforma field: GA28b-q. Proforma field: GA29b-q. Proforma field: GAT6-q. Proforma field: GAP5-q.
has OBO namespace: spatial_qualifier
in subset: camcur
has definition: 60-100% of egg length from the posterior tip (0%) of the egg or pre-gastrula embryo.
  type: Definition
  has db xref: FB:ds
    type: DbXref
    has URI: http://purl.org/obo/owl/FB#FB_ds

60-80% egg length
type: Class
subclass of: egg length
comment: Proforma field: GA17-q. Proforma field: GA28b-q. Proforma field: GA29b-q. Proforma field: GAT6-q. Proforma field: GAP5-q.
has OBO namespace: spatial_qualifier
in subset: camcur
has definition: 60-80% of egg length from the posterior tip (0%) of the egg or pre-gastrula embryo.
  type: Definition
  has db xref: FB:ds
    type: DbXref
    has URI: http://purl.org/obo/owl/FB#FB_ds

60-90% egg length
type: Class
subclass of: egg length
comment: Proforma field: GA17-q. Proforma field: GA28b-q. Proforma field: GA29b-q. Proforma field: GAT6-q. Proforma field: GAP5-q.
has OBO namespace: spatial_qualifier
in subset: camcur
has definition: 60-90% of egg length from the posterior tip (0%) of the egg or pre-gastrula embryo.
  type: Definition
  has db xref: FB:ds
    type: DbXref
    has URI: http://purl.org/obo/owl/FB#FB_ds

70% egg length
type: Class
subclass of: egg length
comment: Proforma field: GA17-q. Proforma field: GA28b-q. Proforma field: GA29b-q. Proforma field: GAT6-q. Proforma field: GAP5-q.
has OBO namespace: spatial_qualifier
in subset: camcur
has definition: 70% of egg length from the posterior tip of the egg or pre-gastrula embryo.
  type: Definition
  has db xref: FB:ds
    type: DbXref
    has URI: http://purl.org/obo/owl/FB#FB_ds

70-100% egg length
type: Class
subclass of: egg length
comment: Proforma field: GA17-q. Proforma field: GA28b-q. Proforma field: GA29b-q. Proforma field: GAT6-q. Proforma field: GAP5-q.
has OBO namespace: spatial_qualifier
in subset: camcur
has definition: 70-100% of egg length from the posterior tip (0%) of the egg or pre-gastrula embryo
  type: Definition
  has db xref: FB:ds
    type: DbXref
    has URI: http://purl.org/obo/owl/FB#FB_ds

70-80% egg length
type: Class
subclass of: egg length
comment: Proforma field: GA17-q. Proforma field: GA28b-q. Proforma field: GA29b-q. Proforma field: GAT6-q. Proforma field: GAP5-q.
has OBO namespace: spatial_qualifier
in subset: camcur
has definition: 70-80% of egg length from the posterior tip (0%) of the egg or pre-gastrula embryo.
  type: Definition
  has db xref: FB:ds
    type: DbXref
    has URI: http://purl.org/obo/owl/FB#FB_ds

70-90% egg length
type: Class
subclass of: egg length
comment: Proforma field: GA17-q. Proforma field: GA28b-q. Proforma field: GA29b-q. Proforma field: GAT6-q. Proforma field: GAP5-q.
has OBO namespace: spatial_qualifier
in subset: camcur
has definition: 70-90% of egg length from the posterior tip (0%) of the egg or pre-gastrula embryo.
  type: Definition
  has db xref: FB:ds
    type: DbXref
    has URI: http://purl.org/obo/owl/FB#FB_ds

80% egg length
type: Class
subclass of: egg length
comment: Proforma field: GA17-q. Proforma field: GA28b-q. Proforma field: GA29b-q. Proforma field: GAT6-q. Proforma field: GAP5-q.
has OBO namespace: spatial_qualifier
in subset: camcur
has definition: 80% of egg length from the posterior tip of the egg or pre-gastrula embryo.
  type: Definition
  has db xref: FB:ds
    type: DbXref
    has URI: http://purl.org/obo/owl/FB#FB_ds

80-90% egg length
type: Class
subclass of: egg length
comment: Proforma field: GA17-q. Proforma field: GA28b-q. Proforma field: GA29b-q. Proforma field: GAT6-q. Proforma field: GAP5-q.
has OBO namespace: spatial_qualifier
in subset: camcur
has definition: 70-90% of egg length from the posterior tip (0%) of the egg or pre-gastrula embryo.
  type: Definition
  has db xref: FB:ds
    type: DbXref
    has URI: http://purl.org/obo/owl/FB#FB_ds

90% egg length
type: Class
subclass of: egg length
comment: Proforma field: GA17-q. Proforma field: GA28b-q. Proforma field: GA29b-q. Proforma field: GAT6-q. Proforma field: GAP5-q.
has OBO namespace: spatial_qualifier
in subset: camcur
has definition: 90% of egg length from the posterior tip of the egg or pre-gastrula embryo.
  type: Definition
  has db xref: FB:ds
    type: DbXref
    has URI: http://purl.org/obo/owl/FB#FB_ds

90-100% egg length
type: Class
subclass of: egg length
comment: Proforma field: GA17-q. Proforma field: GA28b-q. Proforma field: GA29b-q. Proforma field: GAT6-q. Proforma field: GAP5-q.
has OBO namespace: spatial_qualifier
has alternative id: FBcv:0000138
in subset: camcur
has related synonym: 90-100% egg length
has definition: 90-100% of egg length from the posterior tip (0%) of the egg or pre-gastrula embryo.
  type: Definition
  has db xref: FB:ds
    type: DbXref
    has URI: http://purl.org/obo/owl/FB#FB_ds

FlyBase analysis
type: Class
subclass of: publication class
comment: Proforma field: P1.
has OBO namespace: pub_type
in subset: camcur

gradient
type: Class
subclass of: spatial qualifier
comment: Proforma field: GA17-q. Proforma field: GA28b-q. Proforma field: GA29b-q. Proforma field: GAT6-q. Proforma field: GAP5-q.
has OBO namespace: spatial_qualifier
in subset: camcur

anterior posterior gradient
type: Class
subclass of: gradient
comment: Proforma field: GA17-q. Proforma field: GA28b-q. Proforma field: GA29b-q. Proforma field: GAT6-q. Proforma field: GAP5-q.
has OBO namespace: spatial_qualifier
in subset: camcur

dorsal ventral gradient
type: Class
subclass of: gradient
comment: Proforma field: GA17-q. Proforma field: GA28b-q. Proforma field: GA29b-q. Proforma field: GAT6-q. Proforma field: GAP5-q.
has OBO namespace: spatial_qualifier
in subset: camcur

maternal pattern
type: Class
subclass of: ObsoleteClass
comment: Proforma field: GA17-q. Proforma field: GA28b-q. Proforma field: GA29b-q. Proforma field: GAT6-q. Proforma field: GAP5-q.
has OBO namespace: FlyBase miscellaneous CV

striped
type: Class
subclass of: spatial qualifier
comment: Proforma field: GA17-q. Proforma field: GA28b-q. Proforma field: GA29b-q. Proforma field: GAT6-q. Proforma field: GAP5-q.
has OBO namespace: spatial_qualifier
in subset: camcur
has definition: Restricted to stripes in some specified type
  type: Definition
  has db xref: FB:DS
    type: DbXref
    has URI: http://purl.org/obo/owl/FB#FB_DS

I-CreI endonuclease
type: Class
subclass of: site specific recombinase
comment: Proforma field: GA8. Proforma field: A4.
has OBO namespace: origin_of_mutation
in subset: camcur
has definition: Endonuclease that recognizes and cleaves a 19-24 bp palindromic DNA site.
  type: Definition
  has db xref: UniProt:P05725
    type: DbXref
    has URI: http://purl.org/obo/owl/UniProt#UniProt_P05725

even pair rule
type: Class
subclass of: pair rule
comment: Proforma field: GA17-q. Proforma field: GA28b-q. Proforma field: GA29b-q. Proforma field: GAT6-q. Proforma field: GAP5-q.
has OBO namespace: embryonic_pattern_qualifier
in subset: camcur

odd pair rule
type: Class
subclass of: pair rule
comment: Proforma field: GA17-q. Proforma field: GA28b-q. Proforma field: GA29b-q. Proforma field: GAT6-q. Proforma field: GAP5-q.
has OBO namespace: embryonic_pattern_qualifier
in subset: camcur

species list
type: Class
subclass of: publication class
comment: Proforma field: P1.
has OBO namespace: pub_type
in subset: camcur

segmentally repeated
type: Class
subclass of: spatial qualifier
comment: Proforma field: GA17-q. Proforma field: GA28b-q. Proforma field: GA29b-q. Proforma field: GAT6-q. Proforma field: GAP5-q.
has OBO namespace: spatial_qualifier
in subset: camcur
has definition: Restricted to a segmentally repeated pattern with some specified type.
  type: Definition
  has db xref: FB:DS
    type: DbXref
    has URI: http://purl.org/obo/owl/FB#FB_DS

archive
type: Class
subclass of: publication class
comment: Proforma field: P1.
has OBO namespace: pub_type
in subset: camcur

balancer stock
type: Class
subclass of: mutant stock
has OBO namespace: FlyBase miscellaneous CV
has definition: A stock with one or more chromosomes (balancers) that are used primarily for their ability to preserve a stock genotype without selection.
  type: Definition
  has db xref: FB:KM
    type: DbXref
    has URI: http://purl.org/obo/owl/FB#FB_KM

cell autonomous
type: Class
subclass of: cell autonomy qualifier
comment: Proforma field: GA56-q. Proforma field: GA28a-q. Proforma field: GA29a-q. Proforma field: GA17-q. Proforma field: GA28b-q. Proforma field: GA29b-q. Proforma field: GAT6-q. Proforma field: GAP5-q.
has OBO namespace: genotype_to_phenotype_relation
in subset: camcur
has definition: A phenotypic effect which is expressed in and limited to cells of the mutant genetic constitution under investigation is said to be cell autonomous.
  type: Definition
  has db xref: FB:FBrf0002379
    type: DbXref
    has URI: http://purl.org/obo/owl/FB#FB_FBrf0002379

cell non-autonomous
type: Class
subclass of: cell autonomy qualifier
comment: Proforma field: GA56-q. Proforma field: GA28a-q. Proforma field: GA29a-q. Proforma field: GA17-q. Proforma field: GA28b-q. Proforma field: GA29b-q. Proforma field: GAT6-q. Proforma field: GAP5-q.
has OBO namespace: genotype_to_phenotype_relation
in subset: camcur
has definition: A phenotypic effect which is not expressed in/limited to cells of the mutant genetic constitution under investigation is said to be cell non-autonomous.
  type: Definition
  has db xref: FB:FBrf0002379
    type: DbXref
    has URI: http://purl.org/obo/owl/FB#FB_FBrf0002379

single balancer
type: Class
subclass of: balancer stock
has OBO namespace: FlyBase miscellaneous CV

pair of homologous balancers
type: Class
subclass of: balancer stock
has OBO namespace: FlyBase miscellaneous CV

recessive lethal balancer
type: Class
subclass of: balancer stock
has OBO namespace: FlyBase miscellaneous CV

balancer for chromosome 1
type: Class
subclass of: balancer stock
has OBO namespace: FlyBase miscellaneous CV

balancer for chromosome 2
type: Class
subclass of: balancer stock
has OBO namespace: FlyBase miscellaneous CV

balancer for chromosome 3
type: Class
subclass of: balancer stock
has OBO namespace: FlyBase miscellaneous CV

maternal effect
type: Class
subclass of: parental effect
comment: Proforma field: GA56-q. Proforma field: GA28a-q. Proforma field: GA29a-q. Proforma field: GA17-q. Proforma field: GA28b-q. Proforma field: GA29b-q. Proforma field: GAT6-q. Proforma field: GAP5-q.
has OBO namespace: genotype_to_phenotype_relation
in subset: camcur
has definition: A phenotypic attribute is described as showing a maternal effect when the phenotype of an individual is a manifestation of the genotype of the mother, rather than the genotype of the individual.
  type: Definition
  has db xref: ISBN:0716735202
    type: DbXref
    has URI: http://purl.org/obo/owl/ISBN#ISBN_0716735202

non-rescuable maternal effect
type: Class
subclass of: maternal effect
comment: Proforma field: GA56-q. Proforma field: GA28a-q. Proforma field: GA29a-q. Proforma field: GA17-q. Proforma field: GA28b-q. Proforma field: GA29b-q. Proforma field: GAT6-q. Proforma field: GAP5-q.
has OBO namespace: genotype_to_phenotype_relation
in subset: camcur
has definition: Definition
  label: A phenotypic attribute is described as showing a non-rescuable maternal effect (strict maternal effect) when the introduction of a wild-type copy of the responsible mutation from the father has no ameliorating effect on the maternal effect mutant phenotype.
  has db xref: PMID:2499512
    type: DbXref
    has URI: http://purl.org/obo/owl/PMID#PMID_2499512

rescuable maternal effect
type: Class
subclass of: maternal effect
comment: Proforma field: GA56-q. Proforma field: GA28a-q. Proforma field: GA29a-q. Proforma field: GA17-q. Proforma field: GA28b-q. Proforma field: GA29b-q. Proforma field: GAT6-q. Proforma field: GAP5-q.
has OBO namespace: genotype_to_phenotype_relation
in subset: camcur
has definition: Definition
  label: A phenotypic attribute is described as showing a rescuable maternal effect when the introduction of a wild-type copy of the responsible mutation from the father ameliorates the maternal effect mutant phenotype.
  has db xref: PMID:2499512
    type: DbXref
    has URI: http://purl.org/obo/owl/PMID#PMID_2499512

paternal effect
type: Class
subclass of: parental effect
comment: Proforma field: GA56-q. Proforma field: GA28a-q. Proforma field: GA29a-q. Proforma field: GA17-q. Proforma field: GA28b-q. Proforma field: GA29b-q. Proforma field: GAT6-q. Proforma field: GAP5-q.
has OBO namespace: genotype_to_phenotype_relation
in subset: camcur
has definition: A phenotypic attribute is described as showing a paternal effect when the phenotype of an individual is a manifestation of the genotype of the father, rather than the genotype of the individual.
  type: Definition
  has db xref: PMID:9630751
    type: DbXref
    has URI: http://purl.org/obo/owl/PMID#PMID_9630751

pair of balancers for chromosome 2
type: Class
subclass of: ObsoleteClass
has OBO namespace: FlyBase miscellaneous CV

morphological qualifier
type: Class
subclass of: qualifier
has OBO namespace: expression_qualifier

faint
type: Class
subclass of: morphological qualifier
comment: Proforma field: GA17-q. Proforma field: GA28b-q. Proforma field: GA29b-q. Proforma field: GAT6-q. Proforma field: GAP5-q.
has OBO namespace: expression_qualifier

granular
type: Class
subclass of: morphological qualifier
comment: Proforma field: GA17-q. Proforma field: GA28b-q. Proforma field: GA29b-q. Proforma field: GAT6-q. Proforma field: GAP5-q.
has OBO namespace: expression_qualifier

intense
type: Class
subclass of: morphological qualifier
comment: Proforma field: GA17-q. Proforma field: GA28b-q. Proforma field: GA29b-q. Proforma field: GAT6-q. Proforma field: GAP5-q.
has OBO namespace: expression_qualifier

punctate
type: Class
subclass of: morphological qualifier
comment: Proforma field: GA17-q. Proforma field: GA28b-q. Proforma field: GA29b-q. Proforma field: GAT6-q. Proforma field: GAP5-q.
has OBO namespace: expression_qualifier

uniform
type: Class
subclass of: morphological qualifier
comment: Proforma field: GA17-q. Proforma field: GA28b-q. Proforma field: GA29b-q. Proforma field: GAT6-q. Proforma field: GAP5-q.
has OBO namespace: expression_qualifier

variable
type: Class
subclass of: morphological qualifier
comment: Proforma field: GA17-q. Proforma field: GA28b-q. Proforma field: GA29b-q. Proforma field: GAT6-q. Proforma field: GAP5-q.
has OBO namespace: expression_qualifier

pair of balancers for chromosome 3
type: Class
subclass of: ObsoleteClass
has OBO namespace: FlyBase miscellaneous CV

dominant male sterile balancer
type: Class
subclass of: balancer stock
has OBO namespace: FlyBase miscellaneous CV

dominant female sterile balancer
type: Class
subclass of: balancer stock
has OBO namespace: FlyBase miscellaneous CV

temporal qualifier
type: Class
subclass of: qualifier
comment: Proforma field: GA17-q. Proforma field: GA28b-q. Proforma field: GA29b-q. Proforma field: GAT6-q. Proforma field: GAP5-q.
has OBO namespace: temporal_qualifier

dominant female sterile balancer for chromosome 2
type: Class
subclass of: ObsoleteClass
has OBO namespace: FlyBase miscellaneous CV

early
type: Class
subclass of: relative temporal qualifier
comment: Proforma field: GA17-q. Proforma field: GA28b-q. Proforma field: GA29b-q. Proforma field: GAT6-q. Proforma field: GAP5-q.nnDeprecated: Use of this term is discouraged as there is no way to decide how to group anatomy terms combined with this qualifier with other terms in the anatomy ontology. Subject to discussion and once its usage in old curation is removed, this term will be obsoleted. DS
has OBO namespace: temporal_qualifier

dominant female sterile balancer for chromosome 3
type: Class
subclass of: ObsoleteClass
has OBO namespace: FlyBase miscellaneous CV

dominant male sterile balancer for chromosome 2
type: Class
subclass of: ObsoleteClass
has OBO namespace: FlyBase miscellaneous CV

late
type: Class
subclass of: relative temporal qualifier
comment: Proforma field: GA17-q. Proforma field: GA28b-q. Proforma field: GA29b-q. Proforma field: GAT6-q. Proforma field: GAP5-q.nnDeprecated: Use of this term is discouraged as there is no way to decide how to group anatomy terms combined with this qualifier with other terms in the anatomy ontology. Subject to discussion and once its usage in old curation is removed, this term will be obsoleted. DS
has OBO namespace: temporal_qualifier

mid
type: Class
subclass of: relative temporal qualifier
comment: Proforma field: GA17-q. Proforma field: GA28b-q. Proforma field: GA29b-q. Proforma field: GAT6-q. Proforma field: GAP5-q.nnDeprecated: Use of this term is discouraged as there is no way to decide how to group anatomy terms combined with this qualifier with other terms in the anatomy ontology. Subject to discussion and once its usage in old curation is removed, this term will be obsoleted. DS
has OBO namespace: temporal_qualifier

n day
type: Class
subclass of: absolute temporal qualifier
comment: Proforma field: GA17-q. Proforma field: GA28b-q. Proforma field: GA29b-q. Proforma field: GAT6-q. Proforma field: GAP5-q.nnDeprecated: Use of this term is discouraged as there is no way to decide how to group anatomy terms combined with this qualifier with other terms in the anatomy ontology. Subject to discussion and once its usage in old curation is removed, this term will be obsoleted. DS
has OBO namespace: temporal_qualifier

n hr
type: Class
subclass of: absolute temporal qualifier
comment: Proforma field: GA17-q. Proforma field: GA28b-q. Proforma field: GA29b-q. Proforma field: GAT6-q. Proforma field: GAP5-q.nnDeprecated: Use of this term is discouraged as there is no way to decide how to group anatomy terms combined with this qualifier with other terms in the anatomy ontology. Subject to discussion and once its usage in old curation is removed, this term will be obsoleted. DS
has OBO namespace: temporal_qualifier

dominant male sterile balancer for chromosome 3
type: Class
subclass of: ObsoleteClass
has OBO namespace: FlyBase miscellaneous CV

recessive lethal balancer for chromosome 1
type: Class
subclass of: ObsoleteClass
has OBO namespace: FlyBase miscellaneous CV

recessive lethal balancer for chromosome 2
type: Class
subclass of: ObsoleteClass
has OBO namespace: FlyBase miscellaneous CV

publication descriptor
type: Class
subclass of: descriptor
has OBO namespace: FlyBase miscellaneous CV

publication class
type: Class
subclass of: publication descriptor
comment: Proforma field: P1.
has OBO namespace: pub_type
in subset: camcur

abstract
type: Class
subclass of: publication class
comment: Proforma field: P1.
has OBO namespace: pub_type
in subset: camcur

advertisement
type: Class
subclass of: publication class
comment: Proforma field: P1.
has OBO namespace: pub_type
in subset: camcur

autobiography
type: Class
subclass of: publication class
comment: Proforma field: P1.
has OBO namespace: pub_type
in subset: camcur

bibliographic list
type: Class
subclass of: publication class
comment: Proforma field: P1.
has OBO namespace: pub_type
in subset: camcur

biography
type: Class
subclass of: publication class
comment: Proforma field: P1.
has OBO namespace: pub_type
in subset: camcur

book
type: Class
subclass of: publication class
comment: Proforma field: P1.
has OBO namespace: pub_type
in subset: camcur

booklet
type: Class
subclass of: publication class
comment: Proforma field: P1.
has OBO namespace: pub_type
in subset: camcur

book review
type: Class
subclass of: publication class
comment: Proforma field: P1.
has OBO namespace: pub_type
in subset: camcur

computer file
type: Class
subclass of: publication class
comment: Proforma field: P1.
has OBO namespace: pub_type
in subset: camcur
has related synonym: CD-ROM

conference report
type: Class
subclass of: publication class
comment: Proforma field: P1.
has OBO namespace: pub_type
in subset: camcur

demonstration
type: Class
subclass of: publication class
comment: Proforma field: P1.
has OBO namespace: pub_type
in subset: camcur

DNA/RNA sequence record
type: Class
subclass of: publication class
comment: Proforma field: P1.
has OBO namespace: pub_type
in subset: camcur

protein sequence record
type: Class
subclass of: publication class
comment: Proforma field: P1.
has OBO namespace: pub_type
in subset: camcur

erratum
type: Class
subclass of: publication class
comment: Proforma field: P1.
has OBO namespace: pub_type
in subset: camcur
has related synonym: correction

film
type: Class
subclass of: publication class
comment: Proforma field: P1.
has OBO namespace: pub_type
in subset: camcur
has related synonym: video

interview
type: Class
subclass of: publication class
comment: Proforma field: P1.
has OBO namespace: pub_type
in subset: camcur

jigsaw puzzle
type: Class
subclass of: publication class
comment: Proforma field: P1.
has OBO namespace: pub_type
in subset: camcur

letter
type: Class
subclass of: publication class
comment: Proforma field: P1.
has OBO namespace: pub_type
in subset: camcur

microscope slides
type: Class
subclass of: publication class
comment: Proforma field: P1.
has OBO namespace: pub_type
in subset: camcur

news article
type: Class
subclass of: publication class
comment: Proforma field: P1.
has OBO namespace: pub_type
in subset: camcur

note
type: Class
subclass of: publication class
comment: Proforma field: P1.
has OBO namespace: pub_type
in subset: camcur

obituary
type: Class
subclass of: publication class
comment: Proforma field: P1.
has OBO namespace: pub_type
in subset: camcur

paper
type: Class
subclass of: publication class
comment: Proforma field: P1.
has OBO namespace: pub_type
in subset: camcur

patent
type: Class
subclass of: publication class
comment: Proforma field: P1.
has OBO namespace: pub_type
in subset: camcur

personal communication to FlyBase
type: Class
subclass of: publication class
comment: Proforma field: P1.
has OBO namespace: pub_type
in subset: camcur

poem
type: Class
subclass of: publication class
comment: Proforma field: P1.
has OBO namespace: pub_type
in subset: camcur

poster
type: Class
subclass of: publication class
comment: Proforma field: P1.
has OBO namespace: pub_type
in subset: camcur

press release
type: Class
subclass of: publication class
comment: Proforma field: P1.
has OBO namespace: pub_type
in subset: camcur

recording
type: Class
subclass of: publication class
comment: Proforma field: P1.
has OBO namespace: pub_type
in subset: camcur

retraction
type: Class
subclass of: publication class
comment: Proforma field: P1.
has OBO namespace: pub_type
in subset: camcur
has related synonym: erratum

review
type: Class
subclass of: publication class
comment: Proforma field: P1.
has OBO namespace: pub_type
in subset: camcur

slides
type: Class
subclass of: publication class
comment: Proforma field: P1.
has OBO namespace: pub_type
in subset: camcur

spoof
type: Class
subclass of: publication class
comment: Proforma field: P1.
has OBO namespace: pub_type
in subset: camcur

stock list
type: Class
subclass of: publication class
comment: Proforma field: P1.
has OBO namespace: pub_type
in subset: camcur

supplementary material
type: Class
subclass of: publication class
comment: Proforma field: P1.
has OBO namespace: pub_type
in subset: camcur

T-shirt
type: Class
subclass of: publication class
comment: Proforma field: P1.
has OBO namespace: pub_type
in subset: camcur

tactile diagram
type: Class
subclass of: publication class
comment: Proforma field: P1.
has OBO namespace: pub_type
in subset: camcur

teaching note
type: Class
subclass of: publication class
comment: Proforma field: P1.
has OBO namespace: pub_type
in subset: camcur

thesis
type: Class
subclass of: publication class
comment: Proforma field: P1.
has OBO namespace: pub_type
in subset: camcur

curated genome annotation
type: Class
subclass of: publication class
comment: Proforma field: P1.
has OBO namespace: pub_type
in subset: camcur

automatic genome annotation
type: Class
subclass of: publication class
comment: Proforma field: P1.
has OBO namespace: pub_type
in subset: camcur

white paper
type: Class
subclass of: publication class
comment: Proforma field: P1.
has OBO namespace: pub_type
in subset: camcur

recessive lethal balancer for chromosome 3
type: Class
subclass of: ObsoleteClass
has OBO namespace: FlyBase miscellaneous CV

unpublished
type: Class
subclass of: publication class
comment: Proforma field: P1.
has OBO namespace: pub_type
in subset: camcur
has related synonym: privately distributed report

publication language
type: Class
subclass of: publication descriptor
comment: Proforma field: P13. Proforma field: P14.
has OBO namespace: language
in subset: camcur

Afrikaans
type: Class
subclass of: publication language
comment: Proforma field: P13. Proforma field: P14.
has OBO namespace: language
in subset: camcur

Arabic
type: Class
subclass of: publication language
comment: Proforma field: P13. Proforma field: P14.
has OBO namespace: language
in subset: camcur

Armenian
type: Class
subclass of: publication language
comment: Proforma field: P13. Proforma field: P14.
has OBO namespace: language
in subset: camcur

Belarussian
type: Class
subclass of: publication language
comment: Proforma field: P13. Proforma field: P14.
has OBO namespace: language
in subset: camcur
has related synonym: Belarusian

Bulgarian
type: Class
subclass of: publication language
comment: Proforma field: P13. Proforma field: P14.
has OBO namespace: language
in subset: camcur

Catalan
type: Class
subclass of: publication language
comment: Proforma field: P13. Proforma field: P14.
has OBO namespace: language
in subset: camcur

Chinese
type: Class
subclass of: publication language
comment: Proforma field: P13. Proforma field: P14.
has OBO namespace: language
in subset: camcur

Cumbrian
type: Class
subclass of: publication language
comment: Proforma field: P13. Proforma field: P14.
has OBO namespace: language
in subset: camcur

Czech
type: Class
subclass of: publication language
comment: Proforma field: P13. Proforma field: P14.
has OBO namespace: language
in subset: camcur

Danish
type: Class
subclass of: publication language
comment: Proforma field: P13. Proforma field: P14.
has OBO namespace: language
in subset: camcur

Dutch
type: Class
subclass of: publication language
comment: Proforma field: P13. Proforma field: P14.
has OBO namespace: language
in subset: camcur

English
type: Class
subclass of: publication language
comment: Proforma field: P13. Proforma field: P14.
has OBO namespace: language
in subset: camcur

Estonian
type: Class
subclass of: publication language
comment: Proforma field: P13. Proforma field: P14.
has OBO namespace: language
in subset: camcur

Faroese
type: Class
subclass of: publication language
comment: Proforma field: P13. Proforma field: P14.
has OBO namespace: language
in subset: camcur

Farsi
type: Class
subclass of: publication language
comment: Proforma field: P13. Proforma field: P14.
has OBO namespace: language
in subset: camcur

Finnish
type: Class
subclass of: publication language
comment: Proforma field: P13. Proforma field: P14.
has OBO namespace: language
in subset: camcur

Flemish
type: Class
subclass of: publication language
comment: Proforma field: P13. Proforma field: P14.
has OBO namespace: language
in subset: camcur

French
type: Class
subclass of: publication language
comment: Proforma field: P13. Proforma field: P14.
has OBO namespace: language
in subset: camcur

German
type: Class
subclass of: publication language
comment: Proforma field: P13. Proforma field: P14.
has OBO namespace: language
in subset: camcur

Greek
type: Class
subclass of: publication language
comment: Proforma field: P13. Proforma field: P14.
has OBO namespace: language
in subset: camcur

Hebrew
type: Class
subclass of: publication language
comment: Proforma field: P13. Proforma field: P14.
has OBO namespace: language
in subset: camcur

Hungarian
type: Class
subclass of: publication language
comment: Proforma field: P13. Proforma field: P14.
has OBO namespace: language
in subset: camcur

Icelandic
type: Class
subclass of: publication language
comment: Proforma field: P13. Proforma field: P14.
has OBO namespace: language
in subset: camcur

Indonesian
type: Class
subclass of: publication language
comment: Proforma field: P13. Proforma field: P14.
has OBO namespace: language
in subset: camcur

Italian
type: Class
subclass of: publication language
comment: Proforma field: P13. Proforma field: P14.
has OBO namespace: language
in subset: camcur

Japanese
type: Class
subclass of: publication language
comment: Proforma field: P13. Proforma field: P14.
has OBO namespace: language
in subset: camcur

Jugoslavian
type: Class
subclass of: publication language
comment: Proforma field: P13. Proforma field: P14.
has OBO namespace: language
in subset: camcur

Korean
type: Class
subclass of: publication language
comment: Proforma field: P13. Proforma field: P14.
has OBO namespace: language
in subset: camcur

Latin
type: Class
subclass of: publication language
comment: Proforma field: P13. Proforma field: P14.
has OBO namespace: language
in subset: camcur

Latvian
type: Class
subclass of: publication language
comment: Proforma field: P13. Proforma field: P14.
has OBO namespace: language
in subset: camcur

Lithuanian
type: Class
subclass of: publication language
comment: Proforma field: P13. Proforma field: P14.
has OBO namespace: language
in subset: camcur

Malay
type: Class
subclass of: publication language
comment: Proforma field: P13. Proforma field: P14.
has OBO namespace: language
in subset: camcur

Malayalam
type: Class
subclass of: publication language
comment: Proforma field: P13. Proforma field: P14.
has OBO namespace: language
in subset: camcur

Norwegian
type: Class
subclass of: publication language
comment: Proforma field: P13. Proforma field: P14.
has OBO namespace: language
in subset: camcur

Polish
type: Class
subclass of: publication language
comment: Proforma field: P13. Proforma field: P14.
has OBO namespace: language
in subset: camcur

Portuguese
type: Class
subclass of: publication language
comment: Proforma field: P13. Proforma field: P14.
has OBO namespace: language
in subset: camcur

Serbo-Croat(Roman)
type: Class
subclass of: Serbo-Croat
comment: Proforma field: P13. Proforma field: P14.
has OBO namespace: language
in subset: camcur

Romanian
type: Class
subclass of: publication language
comment: Proforma field: P13. Proforma field: P14.
has OBO namespace: language
in subset: camcur

Russian
type: Class
subclass of: publication language
comment: Proforma field: P13. Proforma field: P14.
has OBO namespace: language
in subset: camcur

Serbo-Croat
type: Class
subclass of: publication language
comment: Proforma field: P13. Proforma field: P14.
has OBO namespace: language
in subset: camcur

Slovak
type: Class
subclass of: publication language
comment: Proforma field: P13. Proforma field: P14.
has OBO namespace: language
in subset: camcur

Slovenian
type: Class
subclass of: publication language
comment: Proforma field: P13. Proforma field: P14.
has OBO namespace: language
in subset: camcur

Spanish
type: Class
subclass of: publication language
comment: Proforma field: P13. Proforma field: P14.
has OBO namespace: language
in subset: camcur

Swedish
type: Class
subclass of: publication language
comment: Proforma field: P13. Proforma field: P14.
has OBO namespace: language
in subset: camcur

Turkish
type: Class
subclass of: publication language
comment: Proforma field: P13. Proforma field: P14.
has OBO namespace: language
in subset: camcur

Ukrainian
type: Class
subclass of: publication language
comment: Proforma field: P13. Proforma field: P14.
has OBO namespace: language
in subset: camcur

Yiddish
type: Class
subclass of: publication language
comment: Proforma field: P13. Proforma field: P14.
has OBO namespace: language
in subset: camcur

mutant scorability rank
type: Class
subclass of: allele descriptor
comment: Proforma field: GA3.
has OBO namespace: scorability

RK1
type: Class
subclass of: mutant scorability rank
comment: Proforma field: GA3.
has OBO namespace: scorability
in subset: camcur

RK2
type: Class
subclass of: mutant scorability rank
comment: Proforma field: GA3.
has OBO namespace: scorability
in subset: camcur

RK3
type: Class
subclass of: mutant scorability rank
comment: Proforma field: GA3.
has OBO namespace: scorability
in subset: camcur

allele morphy class
type: Class
subclass of: allele descriptor
comment: Proforma field: GA4.
has OBO namespace: allele_class

loss of function
type: Class
subclass of: allele morphy class
comment: Proforma field: GA4.
has OBO namespace: allele_class
in subset: camcur

amorph
type: Class
subclass of: loss of function
comment: Proforma field: GA4.
has OBO namespace: allele_class
in subset: camcur

hypomorph
type: Class
subclass of: loss of function
comment: Proforma field: GA4.
has OBO namespace: allele_class
in subset: camcur

gain of function
type: Class
subclass of: allele morphy class
comment: Proforma field: GA4.
has OBO namespace: allele_class
in subset: camcur

neomorph
type: Class
subclass of: gain of function
comment: Proforma field: GA4.
has OBO namespace: allele_class
in subset: camcur

antimorph
type: Class
subclass of: gain of function
comment: Proforma field: GA4.
has OBO namespace: allele_class
in subset: camcur

hypermorph
type: Class
subclass of: gain of function
comment: Proforma field: GA4.
has OBO namespace: allele_class
in subset: camcur

wild-type allele
type: Class
subclass of: allele morphy class
comment: Proforma field: GA4.
has OBO namespace: allele_class
in subset: camcur

wild-type generic
type: Class
subclass of: wild-type allele
comment: Proforma field: GA4.
has OBO namespace: allele_class
in subset: camcur

isoallele
type: Class
subclass of: wild-type allele
comment: Proforma field: GA4.
has OBO namespace: allele_class
in subset: camcur

extracted wild-type chromosome 1
type: Class
subclass of: extracted wild-type chromosome
has OBO namespace: FlyBase miscellaneous CV

recessive
type: Class
subclass of: dominance relationship qualifier
comment: Proforma field: GA56-q. Proforma field: GA28a-q. Proforma field: GA29a-q.
has OBO namespace: dominance_qualifier
in subset: camcur
has definition: A phenotypic attribute is described as recessive when it is manifest only in individuals homozygous or hemizygous for the allele that causes that phenotype.
  type: Definition
  has db xref: ISBN:0805303162
    type: DbXref
    has URI: http://purl.org/obo/owl/ISBN#ISBN_0805303162

dominant
type: Class
subclass of: dominance relationship qualifier
comment: Proforma field: GA56-q. Proforma field: GA28a-q. Proforma field: GA29a-q.
has OBO namespace: dominance_qualifier
in subset: camcur
has definition: A phenotypic attribute is described as dominant when it is manifest in individuals heterozygous for the allele that causes that phenotype.ndefinition_reference: ISBN:0805303162
  type: Definition
  has db xref: ISBN:0805303162
    type: DbXref
    has URI: http://purl.org/obo/owl/ISBN#ISBN_0805303162

codominant
type: Class
subclass of: dominant
comment: Proforma field: GA56-q. Proforma field: GA28a-q. Proforma field: GA29a-q.
has OBO namespace: dominance_qualifier
in subset: camcur
has definition: A phenotypic attribute is described as codominant when it is manifest in individuals carrying the allele that causes that phenotype, irrespective of the homologous allele.
  type: Definition
  has db xref: ISBN:0805303162
    type: DbXref
    has URI: http://purl.org/obo/owl/ISBN#ISBN_0805303162

semidominant
type: Class
subclass of: dominant
comment: Proforma field: GA56-q. Proforma field: GA28a-q. Proforma field: GA29a-q.
has OBO namespace: dominance_qualifier
in subset: camcur
has definition: A phenotypic attribute is described as semidominant when individuals heterozygous for the allele show phenotypes part way between homozygotes for either allele.
  type: Definition
  has db xref: ISBN:0805303162
    type: DbXref
    has URI: http://purl.org/obo/owl/ISBN#ISBN_0805303162

extracted wild-type chromosome 2
type: Class
subclass of: extracted wild-type chromosome
has OBO namespace: FlyBase miscellaneous CV

extracted wild-type chromosome 3
type: Class
subclass of: extracted wild-type chromosome
has OBO namespace: FlyBase miscellaneous CV

extracted wild-type chromosome 4
type: Class
subclass of: extracted wild-type chromosome
has OBO namespace: FlyBase miscellaneous CV

extracted wild-type chromosome Y
type: Class
subclass of: extracted wild-type chromosome
has OBO namespace: FlyBase miscellaneous CV

sex limited
type: Class
subclass of: sex qualifier
comment: Proforma field: GA56-q. Proforma field: GA28a-q. Proforma field: GA29a-q.
has OBO namespace: sex_qualifier
in subset: camcur
has definition: Definition
  label: A phenotypic attribute is described as sex limited if its expression is limited to one or other sex by virtue of the particular biology of that sex, rather than the sex-linkage of the genes underlying the attribute.
  has db xref: ISBN:002418120X
    type: DbXref
    has URI: http://purl.org/obo/owl/ISBN#ISBN_002418120X

male limited
type: Class
subclass of: sex limited
comment: Proforma field: GA56-q. Proforma field: GA28a-q. Proforma field: GA29a-q.
has OBO namespace: sex_qualifier
in subset: camcur
has definition: Definition
  label: A phenotypic attribute is described as male limited if its expression is limited to males by virtue of the particular biology of males, rather than the sex-linkage of the genes underlying the attribute.
  has db xref: ISBN:002418120X
    type: DbXref
    has URI: http://purl.org/obo/owl/ISBN#ISBN_002418120X

female limited
type: Class
subclass of: sex limited
comment: Proforma field: GA56-q. Proforma field: GA28a-q. Proforma field: GA29a-q.
has OBO namespace: sex_qualifier
in subset: camcur
has definition: Definition
  label: A phenotypic attribute is described as female limited if its expression is limited to females by virtue of the particular biology of females, rather than the sex-linkage of the genes underlying the attribute.
  has db xref: ISBN:002418120X
    type: DbXref
    has URI: http://purl.org/obo/owl/ISBN#ISBN_002418120X

conditional qualifier
type: Class
subclass of: qualifier
comment: Proforma field: GA56-q. Proforma field: GA28a-q. Proforma field: GA29a-q. Proforma field: GA17-q. Proforma field: GA28b-q. Proforma field: GA29b-q. Proforma field: GAT6-q. Proforma field: GAP5-q.
has OBO namespace: environmental_qualifier

temperature conditional
type: Class
subclass of: conditional qualifier
comment: Proforma field: GA56-q. Proforma field: GA28a-q. Proforma field: GA29a-q. Proforma field: GA17-q. Proforma field: GA28b-q. Proforma field: GA29b-q. Proforma field: GAT6-q. Proforma field: GAP5-q.
has OBO namespace: environmental_qualifier
in subset: camcur

conditional - heat sensitive
type: Class
subclass of: temperature conditional
comment: Proforma field: GA56-q. Proforma field: GA28a-q. Proforma field: GA29a-q. Proforma field: GA17-q. Proforma field: GA28b-q. Proforma field: GA29b-q. Proforma field: GAT6-q. Proforma field: GAP5-q.
has OBO namespace: environmental_qualifier
in subset: camcur
has exact synonym: hs
has related synonym: conditional ts

conditional - cold sensitive
type: Class
subclass of: temperature conditional
comment: Proforma field: GA56-q. Proforma field: GA28a-q. Proforma field: GA29a-q. Proforma field: GA17-q. Proforma field: GA28b-q. Proforma field: GA29b-q. Proforma field: GAT6-q. Proforma field: GAP5-q.
has OBO namespace: environmental_qualifier
in subset: camcur
has exact synonym: cs
has exact synonym: conditional cs

drug conditional
type: Class
subclass of: conditional qualifier
comment: Proforma field: GA56-q. Proforma field: GA28a-q. Proforma field: GA29a-q. Proforma field: GA17-q. Proforma field: GA28b-q. Proforma field: GA29b-q. Proforma field: GAT6-q. Proforma field: GAP5-q.
has OBO namespace: environmental_qualifier
in subset: camcur

conditional RU486
type: Class
subclass of: drug conditional
comment: Proforma field: GA56-q. Proforma field: GA28a-q. Proforma field: GA29a-q. Proforma field: GA17-q. Proforma field: GA28b-q. Proforma field: GA29b-q. Proforma field: GAT6-q. Proforma field: GAP5-q.
has OBO namespace: environmental_qualifier
in subset: camcur

conditional tetracycline
type: Class
subclass of: drug conditional
comment: Proforma field: GA56-q. Proforma field: GA28a-q. Proforma field: GA29a-q. Proforma field: GA17-q. Proforma field: GA28b-q. Proforma field: GA29b-q. Proforma field: GAT6-q. Proforma field: GAP5-q.
has OBO namespace: environmental_qualifier
in subset: camcur

homeotic
type: Class
subclass of: structural qualifier
comment: Proforma field: GA56-q. Proforma field: GA28a-q. Proforma field: GA29a-q.
has OBO namespace: homeotic
in subset: camcur

isogenic chromosome 1
type: Class
subclass of: isogenic stock
has OBO namespace: FlyBase miscellaneous CV

isogenic chromosome 2
type: Class
subclass of: isogenic stock
has OBO namespace: FlyBase miscellaneous CV

gap
type: Class
subclass of: embryonic pattern qualifier
comment: Proforma field: GA56-q. Proforma field: GA28a-q. Proforma field: GA29a-q. Proforma field: GA17-q. Proforma field: GA28b-q. Proforma field: GA29b-q. Proforma field: GAT6-q. Proforma field: GAP5-q.
has OBO namespace: embryonic_pattern_qualifier
in subset: camcur

terminal
type: Class
subclass of: embryonic pattern qualifier
comment: Proforma field: GA56-q. Proforma field: GA28a-q. Proforma field: GA29a-q. Proforma field: GA17-q. Proforma field: GA28b-q. Proforma field: GA29b-q. Proforma field: GAT6-q. Proforma field: GAP5-q.
has OBO namespace: embryonic_pattern_qualifier
in subset: camcur

isogenic chromosome 3
type: Class
subclass of: isogenic stock
has OBO namespace: FlyBase miscellaneous CV

pair rule
type: Class
subclass of: embryonic pattern qualifier
comment: Proforma field: GA56-q. Proforma field: GA28a-q. Proforma field: GA29a-q. Proforma field: GA17-q. Proforma field: GA28b-q. Proforma field: GA29b-q. Proforma field: GAT6-q. Proforma field: GAP5-q.
has OBO namespace: embryonic_pattern_qualifier
in subset: camcur

segment polarity
type: Class
subclass of: embryonic pattern qualifier
comment: Proforma field: GA56-q. Proforma field: GA28a-q. Proforma field: GA29a-q. Proforma field: GA17-q. Proforma field: GA28b-q. Proforma field: GA29b-q. Proforma field: GAT6-q. Proforma field: GAP5-q.
has OBO namespace: embryonic_pattern_qualifier
in subset: camcur

dorsal-ventral polarity
type: Class
subclass of: embryonic pattern qualifier
comment: Proforma field: GA56-q. Proforma field: GA28a-q. Proforma field: GA29a-q.
has OBO namespace: embryonic_pattern_qualifier
in subset: camcur

neurogenic
type: Class
subclass of: embryonic pattern qualifier
comment: Proforma field: GA56-q. Proforma field: GA28a-q. Proforma field: GA29a-q.
has OBO namespace: embryonic_pattern_qualifier
in subset: camcur

isogenic chromosome 4
type: Class
subclass of: isogenic stock
has OBO namespace: FlyBase miscellaneous CV

P-element transposase source for transposable element mutagenesis
type: Class
subclass of: transposase source for transposable element mutagenesis
has OBO namespace: FlyBase miscellaneous CV

hobo transposase source for transposable element mutagenesis
type: Class
subclass of: transposase source for transposable element mutagenesis
has OBO namespace: FlyBase miscellaneous CV

piggyBac transposase source for transposable element mutagenesis
type: Class
subclass of: transposase source for transposable element mutagenesis
has OBO namespace: FlyBase miscellaneous CV

minos transposase source for transposable element mutagenesis
type: Class
subclass of: transposase source for transposable element mutagenesis
has OBO namespace: FlyBase miscellaneous CV

polyphasic
type: Class
subclass of: temporal stage qualifier
comment: Proforma field: GA56-q. Proforma field: GA28a-q. Proforma field: GA29a-q.nnDeprecated: Use of this term is discouraged as there is no way to decide how to group anatomy terms combined with this qualifier with other terms in the anatomy ontology. Subject to discussion and once its usage in old curation is removed, this term will be obsoleted. DS
has OBO namespace: temporal_qualifier

sex qualifier
type: Class
subclass of: phenotype qualifier
has OBO namespace: sex_qualifier

male
type: Class
subclass of: sex qualifier
comment: Proforma field: GA56-q. Proforma field: GA28a-q. Proforma field: GA29a-q. Proforma field: GA17-q. Proforma field: GA28b-q. Proforma field: GA29b-q. Proforma field: GAT6-q. Proforma field: GAP5-q.
has OBO namespace: sex_qualifier
in subset: camcur

female
type: Class
subclass of: sex qualifier
comment: Proforma field: GA56-q. Proforma field: GA28a-q. Proforma field: GA29a-q. Proforma field: GA17-q. Proforma field: GA28b-q. Proforma field: GA29b-q. Proforma field: GAT6-q. Proforma field: GAP5-q.
has OBO namespace: sex_qualifier
in subset: camcur

germ-line clone
type: Class
subclass of: clone qualifier
comment: Proforma field: GA56-q. Proforma field: GA28a-q. Proforma field: GA29a-q. Proforma field: GA17-q. Proforma field: GA28b-q. Proforma field: GA29b-q. Proforma field: GAT6-q. Proforma field: GAP5-q.
has OBO namespace: clone_qualifier
in subset: camcur

somatic clone
type: Class
subclass of: clone qualifier
comment: Proforma field: GA56-q. Proforma field: GA28a-q. Proforma field: GA29a-q. Proforma field: GA17-q. Proforma field: GA28b-q. Proforma field: GA29b-q. Proforma field: GAT6-q. Proforma field: GAP5-q.
has OBO namespace: clone_qualifier
in subset: camcur

P-element ammunition for transposable element mutagenesis
type: Class
subclass of: ammunition source for transposable element mutagenesis
has OBO namespace: FlyBase miscellaneous CV

hobo ammunition for transposable element mutagenesis
type: Class
subclass of: ammunition source for transposable element mutagenesis
has OBO namespace: FlyBase miscellaneous CV

fully
type: Class
subclass of: qualitative qualifier
comment: Proforma field: GA56-q. Proforma field: GA28a-q. Proforma field: GA29a-q. nnDeprecated: Use of this term is discouraged as 'fully' assumed in the absence of use of 'partially'.
has OBO namespace: extent

partially
type: Class
subclass of: qualitative qualifier
comment: Proforma field: GA56-q. Proforma field: GA28a-q. Proforma field: GA29a-q.
has OBO namespace: extent
in subset: camcur

good
type: Class
subclass of: qualitative qualifier
comment: Proforma field: GA56-q. Proforma field: GA28a-q. Proforma field: GA29a-q.
has OBO namespace: intensity_qualifier
in subset: camcur

poor
type: Class
subclass of: qualitative qualifier
comment: Proforma field: GA56-q. Proforma field: GA28a-q. Proforma field: GA29a-q.
has OBO namespace: intensity_qualifier
in subset: camcur

reduced
type: Class
subclass of: qualitative qualifier
comment: Proforma field: GA56-q. Proforma field: GA28a-q. Proforma field: GA29a-q.
has OBO namespace: intensity_qualifier
in subset: camcur

slow
type: Class
subclass of: qualitative qualifier
comment: Proforma field: GA56-q. Proforma field: GA28a-q. Proforma field: GA29a-q.
has OBO namespace: intensity_qualifier
in subset: camcur

fast
type: Class
subclass of: qualitative qualifier
comment: Proforma field: GA56-q. Proforma field: GA28a-q. Proforma field: GA29a-q.
has OBO namespace: intensity_qualifier
in subset: camcur

intermediate
type: Class
subclass of: qualitative qualifier
comment: Proforma field: GA56-q. Proforma field: GA28a-q. Proforma field: GA29a-q.
has OBO namespace: intensity_qualifier
in subset: camcur

phenotypic class
type: Class
subclass of: allele descriptor
comment: Proforma field: GA56. Proforma field: GA28a. Proforma field: GA29a.
has OBO namespace: phenotypic_class

wild-type
type: Class
subclass of: phenotypic class
comment: Proforma field: GA56. Proforma field: GA28a. Proforma field: GA29a.
has OBO namespace: phenotypic_class
in subset: camcur

viable
type: Class
subclass of: phenotypic class
comment: Proforma field: GA56. Proforma field: GA28a. Proforma field: GA29a. Proforma field: MA8.
has OBO namespace: phenotypic_class
in subset: camcur

semi-viable
type: Class
subclass of: viable
comment: Proforma field: GA56. Proforma field: GA28a. Proforma field: GA29a.
has OBO namespace: phenotypic_class
in subset: camcur

lethal
type: Class
subclass of: phenotypic class
comment: Proforma field: GA56. Proforma field: GA28a. Proforma field: GA29a.
has OBO namespace: phenotypic_class
in subset: camcur

semi-lethal
type: Class
subclass of: lethal
comment: Proforma field: GA56. Proforma field: GA28a. Proforma field: GA29a.
has OBO namespace: phenotypic_class
in subset: camcur

cell lethal
type: Class
subclass of: lethal
comment: Proforma field: GA56. Proforma field: GA28a. Proforma field: GA29a.
has OBO namespace: phenotypic_class
in subset: camcur

visible
type: Class
subclass of: phenotypic class
comment: Proforma field: GA56. Proforma field: GA28a. Proforma field: GA29a.
has OBO namespace: phenotypic_class
in subset: camcur

eye color defective
type: Class
subclass of: visible
comment: Proforma field: GA56. Proforma field: GA28a. Proforma field: GA29a.
has OBO namespace: phenotypic_class
in subset: camcur
has exact synonym: eye colour defective

body color defective
type: Class
subclass of: visible
comment: Proforma field: GA56. Proforma field: GA28a. Proforma field: GA29a.
has OBO namespace: phenotypic_class
in subset: camcur
has exact synonym: body colour defective

size defective
type: Class
subclass of: phenotypic class
comment: Proforma field: GA56. Proforma field: GA28a. Proforma field: GA29a.
has OBO namespace: phenotypic_class
in subset: camcur

small body
type: Class
subclass of: body size defective
comment: Proforma field: GA56. Proforma field: GA28a. Proforma field: GA29a.
has OBO namespace: phenotypic_class
in subset: camcur

reduced cell number
type: Class
subclass of: cell growth defective
comment: Proforma field: GA56. Proforma field: GA28a. Proforma field: GA29a.
has OBO namespace: phenotypic_class
in subset: camcur

reduced cell size
type: Class
subclass of: cell growth defective
subclass of: cell size defective
comment: Proforma field: GA56. Proforma field: GA28a. Proforma field: GA29a.
has OBO namespace: phenotypic_class
in subset: camcur

large body
type: Class
subclass of: body size defective
comment: Proforma field: GA56. Proforma field: GA28a. Proforma field: GA29a.
has OBO namespace: phenotypic_class
in subset: camcur

increased cell number
type: Class
subclass of: cell growth defective
comment: Proforma field: GA56. Proforma field: GA28a. Proforma field: GA29a.
has OBO namespace: phenotypic_class
in subset: camcur

increased cell size
type: Class
subclass of: cell growth defective
subclass of: cell size defective
comment: Proforma field: GA56. Proforma field: GA28a. Proforma field: GA29a.
has OBO namespace: phenotypic_class
in subset: camcur

sterile
type: Class
subclass of: phenotypic class
comment: Proforma field: GA56. Proforma field: GA28a. Proforma field: GA29a.
has OBO namespace: phenotypic_class
in subset: camcur

semi-sterile
type: Class
subclass of: sterile
comment: Proforma field: GA56. Proforma field: GA28a. Proforma field: GA29a.
has OBO namespace: phenotypic_class
in subset: camcur

female sterile
type: Class
subclass of: sterile
comment: Proforma field: GA56. Proforma field: GA28a. Proforma field: GA29a.
has OBO namespace: phenotypic_class
in subset: camcur

female semi-sterile
type: Class
subclass of: semi-sterile
subclass of: female sterile
comment: Proforma field: GA56. Proforma field: GA28a. Proforma field: GA29a.
has OBO namespace: phenotypic_class
in subset: camcur

female sterile germ-line-dependent
type: Class
subclass of: female sterile
comment: Proforma field: GA56. Proforma field: GA28a. Proforma field: GA29a.
has OBO namespace: phenotypic_class
in subset: camcur

female sterile soma-dependent
type: Class
subclass of: female sterile
comment: Proforma field: GA56. Proforma field: GA28a. Proforma field: GA29a.
has OBO namespace: phenotypic_class
in subset: camcur

male sterile
type: Class
subclass of: sterile
comment: Proforma field: GA56. Proforma field: GA28a. Proforma field: GA29a.
has OBO namespace: phenotypic_class
in subset: camcur

male semi-sterile
type: Class
subclass of: semi-sterile
subclass of: male sterile
comment: Proforma field: GA56. Proforma field: GA28a. Proforma field: GA29a.
has OBO namespace: phenotypic_class
in subset: camcur

male sterile germ-line-dependent
type: Class
subclass of: male sterile
comment: Proforma field: GA56. Proforma field: GA28a. Proforma field: GA29a.
has OBO namespace: phenotypic_class
in subset: camcur

male sterile soma-dependent
type: Class
subclass of: male sterile
comment: Proforma field: GA56. Proforma field: GA28a. Proforma field: GA29a.
has OBO namespace: phenotypic_class
in subset: camcur

fertile
type: Class
subclass of: phenotypic class
comment: Proforma field: GA56. Proforma field: GA28a. Proforma field: GA29a. Proforma field: MA8.
has OBO namespace: phenotypic_class
in subset: camcur

semi-fertile
type: Class
subclass of: fertile
comment: Proforma field: GA56. Proforma field: GA28a. Proforma field: GA29a.
has OBO namespace: phenotypic_class
in subset: camcur

male fertile
type: Class
subclass of: fertile
comment: Proforma field: GA56. Proforma field: GA28a. Proforma field: GA29a.
has OBO namespace: phenotypic_class
in subset: camcur

female fertile
type: Class
subclass of: fertile
comment: Proforma field: GA56. Proforma field: GA28a. Proforma field: GA29a.
has OBO namespace: phenotypic_class
in subset: camcur

grandchildless
type: Class
subclass of: sterile
comment: Proforma field: GA56. Proforma field: GA28a. Proforma field: GA29a.
has OBO namespace: phenotypic_class
in subset: camcur

enhancer of variegation
type: Class
subclass of: variegation
comment: Proforma field: GA56. Proforma field: GA28a. Proforma field: GA29a.
has OBO namespace: phenotypic_class
in subset: camcur

non-enhancer of variegation
type: Class
subclass of: variegation
comment: Proforma field: GA56. Proforma field: GA28a. Proforma field: GA29a.
has OBO namespace: phenotypic_class
in subset: camcur

suppressor of variegation
type: Class
subclass of: variegation
comment: Proforma field: GA56. Proforma field: GA28a. Proforma field: GA29a.
has OBO namespace: phenotypic_class
in subset: camcur

non-suppressor of variegation
type: Class
subclass of: variegation
comment: Proforma field: GA56. Proforma field: GA28a. Proforma field: GA29a.
has OBO namespace: phenotypic_class
in subset: camcur

auxotroph
type: Class
subclass of: phenotypic class
comment: Proforma field: GA56. Proforma field: GA28a. Proforma field: GA29a.
has OBO namespace: phenotypic_class
in subset: camcur

aging defective
type: Class
subclass of: phenotypic class
comment: Proforma field: GA56. Proforma field: GA28a. Proforma field: GA29a.
has OBO namespace: phenotypic_class
in subset: camcur

short lived
type: Class
subclass of: aging defective
comment: Proforma field: GA56. Proforma field: GA28a. Proforma field: GA29a.
has OBO namespace: phenotypic_class
in subset: camcur

long lived
type: Class
subclass of: aging defective
comment: Proforma field: GA56. Proforma field: GA28a. Proforma field: GA29a.
has OBO namespace: phenotypic_class
in subset: camcur

behavior defective
type: Class
subclass of: phenotypic class
comment: Proforma field: GA56. Proforma field: GA28a. Proforma field: GA29a.
has OBO namespace: phenotypic_class
in subset: camcur
has related synonym: behavioral
has exact synonym: behavioural

geotaxis behavior defective
type: Class
subclass of: behavior defective
comment: Proforma field: GA56. Proforma field: GA28a. Proforma field: GA29a.
has OBO namespace: phenotypic_class
in subset: camcur
has exact synonym: geotaxis behaviour defective

paralytic
type: Class
subclass of: behavior defective
comment: Proforma field: GA56. Proforma field: GA28a. Proforma field: GA29a.
has OBO namespace: phenotypic_class
in subset: camcur

hypoactive
type: Class
subclass of: behavior defective
comment: Proforma field: GA56. Proforma field: GA28a. Proforma field: GA29a.
has OBO namespace: phenotypic_class
in subset: camcur

bang sensitive
type: Class
subclass of: behavior defective
comment: Proforma field: GA56. Proforma field: GA28a. Proforma field: GA29a.
has OBO namespace: phenotypic_class
in subset: camcur

hyperactive
type: Class
subclass of: behavior defective
comment: Proforma field: GA56. Proforma field: GA28a. Proforma field: GA29a.
has OBO namespace: phenotypic_class
in subset: camcur

pain response defective
type: Class
subclass of: behavior defective
comment: Proforma field: GA56. Proforma field: GA28a. Proforma field: GA29a.
has OBO namespace: phenotypic_class
in subset: camcur

circadian rhythm defective
type: Class
subclass of: behavior defective
comment: Proforma field: GA56. Proforma field: GA28a. Proforma field: GA29a.
has OBO namespace: phenotypic_class
in subset: camcur

locomotor rhythm defective
type: Class
subclass of: circadian rhythm defective
comment: Proforma field: GA56. Proforma field: GA28a. Proforma field: GA29a.
has OBO namespace: phenotypic_class
in subset: camcur

eclosion rhythm defective
type: Class
subclass of: circadian rhythm defective
subclass of: eclosion defective
comment: Proforma field: GA56. Proforma field: GA28a. Proforma field: GA29a.
has OBO namespace: phenotypic_class
in subset: camcur

learning defective
type: Class
subclass of: behavior defective
comment: Proforma field: GA56. Proforma field: GA28a. Proforma field: GA29a.
has OBO namespace: phenotypic_class
in subset: camcur

memory defective
type: Class
subclass of: behavior defective
comment: Proforma field: GA56. Proforma field: GA28a. Proforma field: GA29a.
has OBO namespace: phenotypic_class
in subset: camcur

courtship defective
type: Class
subclass of: behavior defective
comment: Proforma field: GA56. Proforma field: GA28a. Proforma field: GA29a.
has OBO namespace: phenotypic_class
in subset: camcur

mating defective
type: Class
subclass of: courtship defective
comment: Proforma field: GA56. Proforma field: GA28a. Proforma field: GA29a.
has OBO namespace: phenotypic_class
in subset: camcur

mating rhythm defective
type: Class
subclass of: courtship defective
comment: Proforma field: GA56. Proforma field: GA28a. Proforma field: GA29a.
has OBO namespace: phenotypic_class
in subset: camcur

song defective
type: Class
subclass of: courtship defective
comment: Proforma field: GA56. Proforma field: GA28a. Proforma field: GA29a.
has OBO namespace: phenotypic_class
in subset: camcur

chemosensitive behavior defective
type: Class
subclass of: behavior defective
comment: Proforma field: GA56. Proforma field: GA28a. Proforma field: GA29a.
has OBO namespace: phenotypic_class
in subset: camcur
has exact synonym: chemosensitive behaviour defective

olfaction defective
type: Class
subclass of: chemosensitive behavior defective
comment: Proforma field: GA56. Proforma field: GA28a. Proforma field: GA29a.
has OBO namespace: phenotypic_class
in subset: camcur

taste sense defective
type: Class
subclass of: chemosensitive behavior defective
comment: Proforma field: GA56. Proforma field: GA28a. Proforma field: GA29a.
has OBO namespace: phenotypic_class
in subset: camcur
has related synonym: gustation defective

tarsal response defective
type: Class
subclass of: chemosensitive behavior defective
comment: Proforma field: GA56. Proforma field: GA28a. Proforma field: GA29a.
has OBO namespace: phenotypic_class
in subset: camcur

auditory system defective
type: Class
subclass of: behavior defective
comment: Proforma field: GA56. Proforma field: GA28a. Proforma field: GA29a.
has OBO namespace: phenotypic_class
in subset: camcur

environmental stress response defective
type: Class
subclass of: behavior defective
comment: Proforma field: GA56. Proforma field: GA28a. Proforma field: GA29a.
has OBO namespace: phenotypic_class
in subset: camcur

osmotic stress response defective
type: Class
subclass of: environmental stress response defective
comment: Proforma field: GA56. Proforma field: GA28a. Proforma field: GA29a.
has OBO namespace: phenotypic_class
in subset: camcur

heat stress response defective
type: Class
subclass of: environmental stress response defective
comment: Proforma field: GA56. Proforma field: GA28a. Proforma field: GA29a.
has OBO namespace: phenotypic_class
in subset: camcur

visual behavior defective
type: Class
subclass of: behavior defective
comment: Proforma field: GA56. Proforma field: GA28a. Proforma field: GA29a.
has OBO namespace: phenotypic_class
in subset: camcur
has exact synonym: visual behaviour defective

optomotor behavior defective
type: Class
subclass of: visual behavior defective
comment: Proforma field: GA56. Proforma field: GA28a. Proforma field: GA29a.
has OBO namespace: phenotypic_class
in subset: camcur
has exact synonym: optomotor behaviour defective

phototaxis behavior defective
type: Class
subclass of: visual behavior defective
comment: Proforma field: GA56. Proforma field: GA28a. Proforma field: GA29a.
has OBO namespace: phenotypic_class
in subset: camcur
has exact synonym: phototaxis behaviour defective

locomotor behavior defective
type: Class
subclass of: behavior defective
comment: Proforma field: GA56. Proforma field: GA28a. Proforma field: GA29a.
has OBO namespace: phenotypic_class
in subset: camcur
has exact synonym: locomotor behaviour defective

jumpless
type: Class
subclass of: locomotor behavior defective
comment: Proforma field: GA56. Proforma field: GA28a. Proforma field: GA29a.
has OBO namespace: phenotypic_class
in subset: camcur

uncoordinated
type: Class
subclass of: locomotor behavior defective
comment: Proforma field: GA56. Proforma field: GA28a. Proforma field: GA29a.
has OBO namespace: phenotypic_class
in subset: camcur

flight behavior defective
type: Class
subclass of: behavior defective
comment: Proforma field: GA56. Proforma field: GA28a. Proforma field: GA29a.
has OBO namespace: phenotypic_class
in subset: camcur
has exact synonym: flight behaviour defective

flightless
type: Class
subclass of: flight behavior defective
comment: Proforma field: GA56. Proforma field: GA28a. Proforma field: GA29a.
has OBO namespace: phenotypic_class
in subset: camcur

feeding behavior defective
type: Class
subclass of: behavior defective
comment: Proforma field: GA56. Proforma field: GA28a. Proforma field: GA29a.
has OBO namespace: phenotypic_class
in subset: camcur
has exact synonym: feeding behaviour defective

grooming behavior defective
type: Class
subclass of: behavior defective
comment: Proforma field: GA56. Proforma field: GA28a. Proforma field: GA29a.
has OBO namespace: phenotypic_class
in subset: camcur
has exact synonym: grooming behaviour defective

touch sensitivity defective
type: Class
subclass of: behavior defective
comment: Proforma field: GA56. Proforma field: GA28a. Proforma field: GA29a.
has OBO namespace: phenotypic_class
in subset: camcur

photoperiod response variant
type: Class
subclass of: behavior defective
comment: Proforma field: GA56. Proforma field: GA28a. Proforma field: GA29a.
has OBO namespace: phenotypic_class
in subset: camcur

DNA repair defective
type: Class
subclass of: phenotypic class
comment: Proforma field: GA56. Proforma field: GA28a. Proforma field: GA29a.
has OBO namespace: phenotypic_class
in subset: camcur

cell death defective
type: Class
subclass of: phenotypic class
comment: Proforma field: GA56. Proforma field: GA28a. Proforma field: GA29a.
has OBO namespace: phenotypic_class
in subset: camcur

cell death increase
type: Class
subclass of: cell death defective
comment: Proforma field: GA56. Proforma field: GA28a. Proforma field: GA29a.
has OBO namespace: phenotypic_class
in subset: camcur

cell death decrease
type: Class
subclass of: cell death defective
comment: Proforma field: GA56. Proforma field: GA28a. Proforma field: GA29a.
has OBO namespace: phenotypic_class
in subset: camcur

cell growth defective
type: Class
subclass of: phenotypic class
comment: Proforma field: GA56. Proforma field: GA28a. Proforma field: GA29a.
has OBO namespace: phenotypic_class
in subset: camcur

cell size defective
type: Class
subclass of: phenotypic class
comment: Proforma field: GA56. Proforma field: GA28a. Proforma field: GA29a.
has OBO namespace: phenotypic_class
in subset: camcur

cell shape defective
type: Class
subclass of: phenotypic class
comment: Proforma field: GA56. Proforma field: GA28a. Proforma field: GA29a.
has OBO namespace: phenotypic_class
in subset: camcur

cell polarity defective
type: Class
subclass of: phenotypic class
comment: Proforma field: GA56. Proforma field: GA28a. Proforma field: GA29a.
has OBO namespace: phenotypic_class
in subset: camcur

meiotic cell cycle defective
type: Class
subclass of: cell cycle defective
comment: Proforma field: GA56. Proforma field: GA28a. Proforma field: GA29a.
has OBO namespace: phenotypic_class
in subset: camcur
has related synonym: meiotic

mitotic cell cycle defective
type: Class
subclass of: cell cycle defective
comment: Proforma field: GA56. Proforma field: GA28a. Proforma field: GA29a.
has OBO namespace: phenotypic_class
in subset: camcur
has related synonym: mitotic

cytokinesis defective
type: Class
subclass of: phenotypic class
comment: Proforma field: GA56. Proforma field: GA28a. Proforma field: GA29a.
has OBO namespace: phenotypic_class
in subset: camcur

neurophysiology defective
type: Class
subclass of: phenotypic class
comment: Proforma field: GA56. Proforma field: GA28a. Proforma field: GA29a.
has OBO namespace: phenotypic_class
in subset: camcur

neuroanatomy defective
type: Class
subclass of: phenotypic class
comment: Proforma field: GA56. Proforma field: GA28a. Proforma field: GA29a.
has OBO namespace: phenotypic_class
in subset: camcur

sex-determination defective
type: Class
subclass of: phenotypic class
comment: Proforma field: GA56. Proforma field: GA28a. Proforma field: GA29a.
has OBO namespace: phenotypic_class
in subset: camcur

dosage compensation defective
type: Class
subclass of: phenotypic class
comment: Proforma field: GA56. Proforma field: GA28a. Proforma field: GA29a.
has OBO namespace: phenotypic_class
in subset: camcur

electrophoretic variant
type: Class
subclass of: phenotypic class
comment: Proforma field: GA56. Proforma field: GA28a. Proforma field: GA29a.
has OBO namespace: phenotypic_class
in subset: camcur

chemical resistant
type: Class
subclass of: phenotypic class
comment: Proforma field: GA56. Proforma field: GA28a. Proforma field: GA29a.
has OBO namespace: phenotypic_class
in subset: camcur

chemical sensitive
type: Class
subclass of: phenotypic class
comment: Proforma field: GA56. Proforma field: GA28a. Proforma field: GA29a.
has OBO namespace: phenotypic_class
in subset: camcur

radiation resistant
type: Class
subclass of: phenotypic class
comment: Proforma field: GA56. Proforma field: GA28a. Proforma field: GA29a.
has OBO namespace: phenotypic_class
in subset: camcur

radiation sensitive
type: Class
subclass of: phenotypic class
comment: Proforma field: GA56. Proforma field: GA28a. Proforma field: GA29a.
has OBO namespace: phenotypic_class
in subset: camcur

Minute
type: Class
subclass of: phenotypic class
comment: Proforma field: GA56. Proforma field: GA28a. Proforma field: GA29a.
has OBO namespace: phenotypic_class
in subset: camcur

hyperplastic
type: Class
subclass of: phenotypic class
comment: Proforma field: GA56. Proforma field: GA28a. Proforma field: GA29a.
has OBO namespace: phenotypic_class
in subset: camcur

tumorigenic
type: Class
subclass of: phenotypic class
comment: Proforma field: GA56. Proforma field: GA28a. Proforma field: GA29a.
has OBO namespace: phenotypic_class
in subset: camcur

melanotic 'tumor'
type: Class
subclass of: phenotypic class
comment: Proforma field: GA56. Proforma field: GA28a. Proforma field: GA29a.
has OBO namespace: phenotypic_class
in subset: camcur

melanotic necrosis
type: Class
subclass of: phenotypic class
comment: Proforma field: GA56. Proforma field: GA28a. Proforma field: GA29a.
has OBO namespace: phenotypic_class
in subset: camcur

immune response defective
type: Class
subclass of: phenotypic class
comment: Proforma field: GA56. Proforma field: GA28a. Proforma field: GA29a.
has OBO namespace: phenotypic_class
in subset: camcur

tissue polarity defective
type: Class
subclass of: phenotypic class
comment: Proforma field: GA56. Proforma field: GA28a. Proforma field: GA29a.
has OBO namespace: phenotypic_class
in subset: camcur

developmental rate defective
type: Class
subclass of: phenotypic class
comment: Proforma field: GA56. Proforma field: GA28a. Proforma field: GA29a.
has OBO namespace: phenotypic_class
in subset: camcur

wound healing defective
type: Class
subclass of: phenotypic class
comment: Proforma field: GA56. Proforma field: GA28a. Proforma field: GA29a.
has OBO namespace: phenotypic_class
in subset: camcur

origin of mutation
type: Class
subclass of: allele descriptor
comment: Proforma field: GA8. Proforma field: A4.
has OBO namespace: origin_of_mutation

piggyBac ammunition for transposable element mutagenesis
type: Class
subclass of: ammunition source for transposable element mutagenesis
has OBO namespace: FlyBase miscellaneous CV

synthetic
type: Class
subclass of: origin of mutation
comment: Proforma field: GA8. Proforma field: A4.
has OBO namespace: origin_of_mutation
in subset: camcur

in vitro construct
type: Class
subclass of: origin of mutation
comment: Proforma field: GA8. Proforma field: A4.
has OBO namespace: origin_of_mutation

in vitro construct | regulatory fusion
type: Class
subclass of: in vitro construct
comment: Proforma field: GA8. Proforma field: A4.
has OBO namespace: origin_of_mutation
in subset: camcur

in vitro construct | coding region fusion
type: Class
subclass of: in vitro construct
comment: Proforma field: GA8. Proforma field: A4.
has OBO namespace: origin_of_mutation
in subset: camcur

in vitro construct | site directed mutagenesis
type: Class
subclass of: in vitro construct
comment: Proforma field: GA8. Proforma field: A4.
has OBO namespace: origin_of_mutation
in subset: camcur

in vitro construct | deletion
type: Class
subclass of: in vitro construct
comment: Proforma field: GA8. Proforma field: A4.
has OBO namespace: origin_of_mutation
in subset: camcur

in vitro construct | genomic fragment
type: Class
subclass of: in vitro construct
comment: Proforma field: GA8. Proforma field: A4.
has OBO namespace: origin_of_mutation
in subset: camcur

in vitro construct | minigene
type: Class
subclass of: in vitro construct
comment: Proforma field: GA8. Proforma field: A4.
has OBO namespace: origin_of_mutation
in subset: camcur

in vitro construct | amino acid replacement
type: Class
subclass of: in vitro construct
comment: Proforma field: GA8. Proforma field: A4.
has OBO namespace: origin_of_mutation
in subset: camcur

in vitro construct | RNAi
type: Class
subclass of: in vitro construct
comment: Proforma field: GA8. Proforma field: A4.
has OBO namespace: origin_of_mutation
in subset: camcur

in vitro construct | other
type: Class
subclass of: in vitro construct
comment: Proforma field: GA8. Proforma field: A4.
has OBO namespace: origin_of_mutation
in subset: camcur

natural population
type: Class
subclass of: origin of mutation
comment: Proforma field: GA8. Proforma field: A4.
has OBO namespace: origin_of_mutation
in subset: camcur

environmental treatment
type: Class
subclass of: origin of mutation
comment: Proforma field: GA8. Proforma field: A4.
has OBO namespace: origin_of_mutation
in subset: camcur

cold-treatment
type: Class
subclass of: environmental treatment
comment: Proforma field: GA8. Proforma field: A4.
has OBO namespace: origin_of_mutation
in subset: camcur

heat-treatment
type: Class
subclass of: environmental treatment
comment: Proforma field: GA8. Proforma field: A4.
has OBO namespace: origin_of_mutation
in subset: camcur

spontaneous
type: Class
subclass of: origin of mutation
comment: Proforma field: GA8. Proforma field: A4.
has OBO namespace: origin_of_mutation
in subset: camcur

recombination
type: Class
subclass of: origin of mutation
comment: Proforma field: GA8. Proforma field: A4.
has OBO namespace: origin_of_mutation
in subset: camcur

gene conversion
type: Class
subclass of: recombination
comment: Proforma field: GA8. Proforma field: A4.
has OBO namespace: origin_of_mutation
in subset: camcur

intralocus exchange
type: Class
subclass of: recombination
comment: Proforma field: GA8. Proforma field: A4.
has OBO namespace: origin_of_mutation
in subset: camcur

unequal recombination
type: Class
subclass of: recombination
comment: Proforma field: GA8. Proforma field: A4.
has OBO namespace: origin_of_mutation
in subset: camcur

mitotic recombination
type: Class
subclass of: recombination
comment: Proforma field: GA8. Proforma field: A4.
has OBO namespace: origin_of_mutation
in subset: camcur

magnification
type: Class
subclass of: recombination
comment: Proforma field: GA8. Proforma field: A4.
has OBO namespace: origin_of_mutation
in subset: camcur

detachment
type: Class
subclass of: recombination
comment: Proforma field: GA8. Proforma field: A4.
has OBO namespace: origin_of_mutation
in subset: camcur

reduction
type: Class
subclass of: recombination
comment: Proforma field: GA8. Proforma field: A4.
has OBO namespace: origin_of_mutation
in subset: camcur

site specific recombinase
type: Class
subclass of: recombination
comment: Proforma field: GA8. Proforma field: A4.
has OBO namespace: origin_of_mutation
in subset: camcur

FLPase
type: Class
subclass of: site specific recombinase
comment: Proforma field: GA8. Proforma field: A4.
has OBO namespace: origin_of_mutation
in subset: camcur

SCEI endonuclease
type: Class
subclass of: site specific recombinase
comment: Proforma field: GA8. Proforma field: A4.
has OBO namespace: origin_of_mutation
in subset: camcur

cre recombinase
type: Class
subclass of: site specific recombinase
comment: Proforma field: GA8. Proforma field: A4.
has OBO namespace: origin_of_mutation
in subset: camcur
has exact synonym: Cre recombinase
has definition: Catalyzes site-specific recombination between two 34bp loxP sites.
  type: Definition
  has db xref: UniProt:P06956
    type: DbXref
    has URI: http://purl.org/obo/owl/UniProt#UniProt_P06956

segregation
type: Class
subclass of: origin of mutation
comment: Proforma field: GA8. Proforma field: A4.
has OBO namespace: origin_of_mutation
in subset: camcur

transposable element activity
type: Class
subclass of: origin of mutation
comment: Proforma field: GA8. Proforma field: A4.
has OBO namespace: origin_of_mutation
in subset: camcur

IR-hybrid dysgenesis
type: Class
subclass of: transposable element activity
comment: Proforma field: GA8. Proforma field: A4.
has OBO namespace: origin_of_mutation
in subset: camcur
has related synonym: IR

Stalker-hybrid dysgenesis
type: Class
subclass of: transposable element activity
comment: Proforma field: GA8. Proforma field: A4.
has OBO namespace: origin_of_mutation
in subset: camcur

P-element activity
type: Class
subclass of: transposable element activity
comment: Proforma field: GA8. Proforma field: A4.
has OBO namespace: origin_of_mutation
in subset: camcur

PM hybrid dysgenesis
type: Class
subclass of: P-element activity
comment: Proforma field: GA8. Proforma field: A4.
has OBO namespace: origin_of_mutation
in subset: camcur

&Dgr;2-3
type: Class
subclass of: P-element activity
comment: Proforma field: GA8. Proforma field: A4.
has OBO namespace: origin_of_mutation
in subset: camcur

Js
type: Class
subclass of: P-element activity
comment: Proforma field: GA8. Proforma field: A4.
has OBO namespace: origin_of_mutation
in subset: camcur
has related synonym: Jumpstarter

p&pgr;25.1
type: Class
subclass of: P-element activity
comment: Proforma field: GA8. Proforma field: A4.
has OBO namespace: origin_of_mutation
in subset: camcur

p&pgr;25.7wc
type: Class
subclass of: P-element activity
comment: Proforma field: GA8. Proforma field: A4.
has OBO namespace: origin_of_mutation
in subset: camcur

MR
type: Class
subclass of: P-element activity
comment: Proforma field: GA8. Proforma field: A4.
has OBO namespace: origin_of_mutation
in subset: camcur

MR h12
type: Class
subclass of: MR
comment: Proforma field: GA8. Proforma field: A4.
has OBO namespace: origin_of_mutation
in subset: camcur

MR T007
type: Class
subclass of: MR
comment: Proforma field: GA8. Proforma field: A4.
has OBO namespace: origin_of_mutation
in subset: camcur

MRF23.5
type: Class
subclass of: MR
comment: Proforma field: GA8. Proforma field: A4.
has OBO namespace: origin_of_mutation
in subset: camcur

MRF31.1
type: Class
subclass of: MR
comment: Proforma field: GA8. Proforma field: A4.
has OBO namespace: origin_of_mutation
in subset: camcur

hobo activity
type: Class
subclass of: transposable element activity
comment: Proforma field: GA8. Proforma field: A4.
has OBO namespace: origin_of_mutation
in subset: camcur

hobo dysgenesis
type: Class
subclass of: hobo activity
comment: Proforma field: GA8. Proforma field: A4.
has OBO namespace: origin_of_mutation
in subset: camcur

HBL1
type: Class
subclass of: hobo activity
comment: Proforma field: GA8. Proforma field: A4.
has OBO namespace: origin_of_mutation
in subset: camcur
has related synonym: Hobo transposase source
has related synonym: Hobbled1

mariner transposase
type: Class
subclass of: transposable element activity
comment: Proforma field: GA8. Proforma field: A4.
has OBO namespace: origin_of_mutation
in subset: camcur

gypsy element activity
type: Class
subclass of: transposable element activity
comment: Proforma field: GA8. Proforma field: A4.
has OBO namespace: origin_of_mutation
in subset: camcur

piggyBac transposase
type: Class
subclass of: transposable element activity
comment: Proforma field: GA8. Proforma field: A4.
has OBO namespace: origin_of_mutation
in subset: camcur

irradiation
type: Class
subclass of: origin of mutation
comment: Proforma field: GA8. Proforma field: A4.
has OBO namespace: origin_of_mutation
in subset: camcur

ionizing radiation
type: Class
subclass of: irradiation
comment: Proforma field: GA8. Proforma field: A4.
has OBO namespace: origin_of_mutation
in subset: camcur

&agr; ray
type: Class
subclass of: ionizing radiation
comment: Proforma field: GA8. Proforma field: A4.
has OBO namespace: origin_of_mutation
in subset: camcur

&ggr; ray
type: Class
subclass of: ionizing radiation
comment: Proforma field: GA8. Proforma field: A4.
has OBO namespace: origin_of_mutation
in subset: camcur

60 Co &ggr; ray
type: Class
subclass of: &ggr; ray
comment: Proforma field: GA8. Proforma field: A4.
has OBO namespace: origin_of_mutation
in subset: camcur

137 Cs &ggr; ray
type: Class
subclass of: &ggr; ray
comment: Proforma field: GA8. Proforma field: A4.
has OBO namespace: origin_of_mutation
in subset: camcur

226 Ra &agr; ray
type: Class
subclass of: &ggr; ray
comment: Proforma field: GA8. Proforma field: A4.
has OBO namespace: origin_of_mutation
in subset: camcur
has related synonym: radium

32 P
type: Class
subclass of: ionizing radiation
comment: Proforma field: GA8. Proforma field: A4.
has OBO namespace: origin_of_mutation
in subset: camcur

3 H
type: Class
subclass of: ionizing radiation
comment: Proforma field: GA8. Proforma field: A4.
has OBO namespace: origin_of_mutation
in subset: camcur
has related synonym: tritium

3 H-deoxycytidine
type: Class
subclass of: ionizing radiation
comment: Proforma field: GA8. Proforma field: A4.
has OBO namespace: origin_of_mutation
in subset: camcur

3 H-thymidine
type: Class
subclass of: ionizing radiation
comment: Proforma field: GA8. Proforma field: A4.
has OBO namespace: origin_of_mutation
in subset: camcur

Bevatron irradiation
type: Class
subclass of: ionizing radiation
comment: Proforma field: GA8. Proforma field: A4.
has OBO namespace: origin_of_mutation
in subset: camcur

deuteron irradiation
type: Class
subclass of: ionizing radiation
comment: Proforma field: GA8. Proforma field: A4.
has OBO namespace: origin_of_mutation
in subset: camcur

neutrons
type: Class
subclass of: ionizing radiation
comment: Proforma field: GA8. Proforma field: A4.
has OBO namespace: origin_of_mutation
in subset: camcur

252 Cf fission neutrons
type: Class
subclass of: neutrons
comment: Proforma field: GA8. Proforma field: A4.
has OBO namespace: origin_of_mutation
in subset: camcur

X ray
type: Class
subclass of: ionizing radiation
comment: Proforma field: GA8. Proforma field: A4.
has OBO namespace: origin_of_mutation
in subset: camcur

non-ionizing radiation
type: Class
subclass of: irradiation
comment: Proforma field: GA8. Proforma field: A4.
has OBO namespace: origin_of_mutation
in subset: camcur

magnetic field
type: Class
subclass of: non-ionizing radiation
comment: Proforma field: GA8. Proforma field: A4.
has OBO namespace: origin_of_mutation
in subset: camcur

radio waves
type: Class
subclass of: non-ionizing radiation
comment: Proforma field: GA8. Proforma field: A4.
has OBO namespace: origin_of_mutation
in subset: camcur

stratosphere exposure
type: Class
subclass of: non-ionizing radiation
comment: Proforma field: GA8. Proforma field: A4.
has OBO namespace: origin_of_mutation
in subset: camcur

supersonic-treatment
type: Class
subclass of: non-ionizing radiation
comment: Proforma field: GA8. Proforma field: A4.
has OBO namespace: origin_of_mutation
in subset: camcur

U.V.
type: Class
subclass of: non-ionizing radiation
comment: Proforma field: GA8. Proforma field: A4.
has OBO namespace: origin_of_mutation
in subset: camcur

chemical
type: Class
subclass of: origin of mutation
comment: Proforma field: GA8. Proforma field: A4.
has OBO namespace: origin_of_mutation
in subset: camcur

alkylating agent
type: Class
subclass of: chemical
comment: Proforma field: GA8. Proforma field: A4.
has OBO namespace: origin_of_mutation
in subset: camcur

diethyl sulfate
type: Class
subclass of: alkylating agent
comment: Proforma field: GA8. Proforma field: A4.
has OBO namespace: origin_of_mutation
in subset: camcur
has related synonym: DES

2-chloroethyl methanesulfonate
type: Class
subclass of: alkylating agent
comment: Proforma field: GA8. Proforma field: A4.
has OBO namespace: origin_of_mutation
in subset: camcur
has related synonym: CB1506

2-fluoroethyl methanesulfonate
type: Class
subclass of: alkylating agent
comment: Proforma field: GA8. Proforma field: A4.
has OBO namespace: origin_of_mutation
in subset: camcur
has related synonym: CB1522

ethyl methanesulfonate
type: Class
subclass of: alkylating agent
comment: Proforma field: GA8. Proforma field: A4.
has OBO namespace: origin_of_mutation
in subset: camcur
has related synonym: EMS
has related synonym: CB1528

ethyl nitrosourea
type: Class
subclass of: alkylating agent
comment: Proforma field: GA8. Proforma field: A4.
has OBO namespace: origin_of_mutation
in subset: camcur
has related synonym: ENU

hycanthon methanesulfonate
type: Class
subclass of: alkylating agent
comment: Proforma field: GA8. Proforma field: A4.
has OBO namespace: origin_of_mutation
in subset: camcur
has related synonym: HMS

methyl methanesulfonate
type: Class
subclass of: alkylating agent
comment: Proforma field: GA8. Proforma field: A4.
has OBO namespace: origin_of_mutation
in subset: camcur
has related synonym: CB1540
has related synonym: MMS

mustard gas
type: Class
subclass of: alkylating agent
comment: Proforma field: GA8. Proforma field: A4.
has OBO namespace: origin_of_mutation
in subset: camcur
has related synonym: 1,1'-thiobis[2-chloroethane

N-methyl-N'-nitro-N-nitrosoguanidine
type: Class
subclass of: alkylating agent
comment: Proforma field: GA8. Proforma field: A4.
has OBO namespace: origin_of_mutation
in subset: camcur
has related synonym: MNNG
has related synonym: NNG

sulfur mustard
type: Class
subclass of: alkylating agent
comment: Proforma field: GA8. Proforma field: A4.
has OBO namespace: origin_of_mutation
in subset: camcur
has related synonym: CB1735

minos ammunition for transposable element mutagenesis
type: Class
subclass of: ammunition source for transposable element mutagenesis
has OBO namespace: FlyBase miscellaneous CV

carbamate
type: Class
subclass of: chemical
comment: Proforma field: GA8. Proforma field: A4.
has OBO namespace: origin_of_mutation
in subset: camcur

urethane
type: Class
subclass of: carbamate
comment: Proforma field: GA8. Proforma field: A4.
has OBO namespace: origin_of_mutation
in subset: camcur

vinyl carbamate
type: Class
subclass of: carbamate
comment: Proforma field: GA8. Proforma field: A4.
has OBO namespace: origin_of_mutation
in subset: camcur

intercalating agent
type: Class
subclass of: chemical
comment: Proforma field: GA8. Proforma field: A4.
has OBO namespace: origin_of_mutation
in subset: camcur

mitomycin C
type: Class
subclass of: intercalating agent
comment: Proforma field: GA8. Proforma field: A4.
has OBO namespace: origin_of_mutation
in subset: camcur

ICR 100
type: Class
subclass of: intercalating agent
comment: Proforma field: GA8. Proforma field: A4.
has OBO namespace: origin_of_mutation
in subset: camcur
has related synonym: 2-methoxy-6-[3-(ethyl-2-chloroethyl)aminopropylamino]acridine
has related synonym: quinacrine mustard

ICR 170
type: Class
subclass of: intercalating agent
comment: Proforma field: GA8. Proforma field: A4.
has OBO namespace: origin_of_mutation
in subset: camcur
has related synonym: 2-methoxy-6-dichloro-9-(3-ethyl-2-chloroethyl-aminopropylamino)acridine-dihydrochloride

1,2-dibromoethane
type: Class
subclass of: intercalating agent
comment: Proforma field: GA8. Proforma field: A4.
has OBO namespace: origin_of_mutation
in subset: camcur
has related synonym: DBE

1,2-dichloroethane
type: Class
subclass of: intercalating agent
comment: Proforma field: GA8. Proforma field: A4.
has OBO namespace: origin_of_mutation
in subset: camcur
has related synonym: DCE

1-bromo-2-chloroethane
type: Class
subclass of: intercalating agent
comment: Proforma field: GA8. Proforma field: A4.
has OBO namespace: origin_of_mutation
in subset: camcur
has related synonym: BCE

base analog
type: Class
subclass of: chemical
comment: Proforma field: GA8. Proforma field: A4.
has OBO namespace: origin_of_mutation
in subset: camcur

5-bromouracil
type: Class
subclass of: base analog
comment: Proforma field: GA8. Proforma field: A4.
has OBO namespace: origin_of_mutation
in subset: camcur

5-bromouridine
type: Class
subclass of: base analog
comment: Proforma field: GA8. Proforma field: A4.
has OBO namespace: origin_of_mutation
in subset: camcur

enzyme inhibitor
type: Class
subclass of: chemical
comment: Proforma field: GA8. Proforma field: A4.
has OBO namespace: origin_of_mutation
in subset: camcur

aminopterin
type: Class
subclass of: enzyme inhibitor
comment: Proforma field: GA8. Proforma field: A4.
has OBO namespace: origin_of_mutation
in subset: camcur

inorganic compound
type: Class
subclass of: chemical
comment: Proforma field: GA8. Proforma field: A4.
has OBO namespace: origin_of_mutation
in subset: camcur

cupric sulfate
type: Class
subclass of: inorganic compound
comment: Proforma field: GA8. Proforma field: A4.
has OBO namespace: origin_of_mutation
in subset: camcur

H 3 BO 3
type: Class
subclass of: inorganic compound
comment: Proforma field: GA8. Proforma field: A4.
has OBO namespace: origin_of_mutation
in subset: camcur

sodium bisulphite
type: Class
subclass of: inorganic compound
comment: Proforma field: GA8. Proforma field: A4.
has OBO namespace: origin_of_mutation
in subset: camcur

sodium fluoride
type: Class
subclass of: inorganic compound
comment: Proforma field: GA8. Proforma field: A4.
has OBO namespace: origin_of_mutation
in subset: camcur

epoxy hydrocarbon
type: Class
subclass of: chemical
comment: Proforma field: GA8. Proforma field: A4.
has OBO namespace: origin_of_mutation
in subset: camcur

diepoxybutane
type: Class
subclass of: epoxy hydrocarbon
comment: Proforma field: GA8. Proforma field: A4.
has OBO namespace: origin_of_mutation
in subset: camcur
has related synonym: erythritol anhydride
has related synonym: DEB

diepoxyoctane
type: Class
subclass of: epoxy hydrocarbon
comment: Proforma field: GA8. Proforma field: A4.
has OBO namespace: origin_of_mutation
in subset: camcur

unclassified chemical
type: Class
subclass of: chemical
comment: Proforma field: GA8. Proforma field: A4.
has OBO namespace: origin_of_mutation
in subset: camcur

1,2:5,6-dibenzanthracene
type: Class
subclass of: unclassified chemical
comment: Proforma field: GA8. Proforma field: A4.
has OBO namespace: origin_of_mutation
in subset: camcur

1,4-dimethanesulfonoxy-1:4-dimethylbutane
type: Class
subclass of: unclassified chemical
comment: Proforma field: GA8. Proforma field: A4.
has OBO namespace: origin_of_mutation
in subset: camcur
has related synonym: CB2348

1,4-dimethanesulfonoxybut-2-yne
type: Class
subclass of: unclassified chemical
comment: Proforma field: GA8. Proforma field: A4.
has OBO namespace: origin_of_mutation
in subset: camcur
has related synonym: CB2058

dominance relationship qualifier
type: Class
subclass of: qualifier
has OBO namespace: dominance_qualifier
has definition: Definition
  label: Dominance relationships describe the dependence of the expression of a phenotypic attribute of an allele on the genotype at the locus in question. An allele might be recessive with respect to one phenotypic attribute, but dominant with respect to another.
  has db xref: FB:rd
    type: DbXref
    has URI: http://purl.org/obo/owl/FB#FB_rd

1,6-dimethylsulfonoxy D-mannitol
type: Class
subclass of: unclassified chemical
comment: Proforma field: GA8. Proforma field: A4.
has OBO namespace: origin_of_mutation
in subset: camcur
has related synonym: CB2511

1,6-dimethylsulfonoxy L-mannitol
type: Class
subclass of: unclassified chemical
comment: Proforma field: GA8. Proforma field: A4.
has OBO namespace: origin_of_mutation
in subset: camcur
has related synonym: CB2628

1-amino-2-naphthol-4-sulfonic acid
type: Class
subclass of: unclassified chemical
comment: Proforma field: GA8. Proforma field: A4.
has OBO namespace: origin_of_mutation
in subset: camcur

1-diethylaminoethylethylamino-4-methyl-thioxanthenone
type: Class
subclass of: unclassified chemical
comment: Proforma field: GA8. Proforma field: A4.
has OBO namespace: origin_of_mutation
in subset: camcur

2-methoxyethanol
type: Class
subclass of: unclassified chemical
comment: Proforma field: GA8. Proforma field: A4.
has OBO namespace: origin_of_mutation
in subset: camcur

2,5,-bisethylene-imine-1,4-benzoquinone
type: Class
subclass of: unclassified chemical
comment: Proforma field: GA8. Proforma field: A4.
has OBO namespace: origin_of_mutation
in subset: camcur

7-bromomethyl 12 methyl benz &agr; anthracine
type: Class
subclass of: unclassified chemical
comment: Proforma field: GA8. Proforma field: A4.
has OBO namespace: origin_of_mutation
in subset: camcur

actinomycin D
type: Class
subclass of: unclassified chemical
comment: Proforma field: GA8. Proforma field: A4.
has OBO namespace: origin_of_mutation
in subset: camcur

benzo(&agr;)pyrene
type: Class
subclass of: unclassified chemical
comment: Proforma field: GA8. Proforma field: A4.
has OBO namespace: origin_of_mutation
in subset: camcur

caffeine
type: Class
subclass of: unclassified chemical
comment: Proforma field: GA8. Proforma field: A4.
has OBO namespace: origin_of_mutation
in subset: camcur

cisplatin
type: Class
subclass of: unclassified chemical
comment: Proforma field: GA8. Proforma field: A4.
has OBO namespace: origin_of_mutation
in subset: camcur
has related synonym: cis-dichlorodiammineplatinum(II)

colchicine
type: Class
subclass of: unclassified chemical
comment: Proforma field: GA8. Proforma field: A4.
has OBO namespace: origin_of_mutation
in subset: camcur

dimethyl sulfoxide
type: Class
subclass of: unclassified chemical
comment: Proforma field: GA8. Proforma field: A4.
has OBO namespace: origin_of_mutation
in subset: camcur

DNA
type: Class
subclass of: unclassified chemical
comment: Proforma field: GA8. Proforma field: A4.
has OBO namespace: origin_of_mutation
in subset: camcur

ethyl ether
type: Class
subclass of: unclassified chemical
comment: Proforma field: GA8. Proforma field: A4.
has OBO namespace: origin_of_mutation
in subset: camcur

ethylenimine
type: Class
subclass of: unclassified chemical
comment: Proforma field: GA8. Proforma field: A4.
has OBO namespace: origin_of_mutation
in subset: camcur
has related synonym: EI

ethylene oxide
type: Class
subclass of: unclassified chemical
comment: Proforma field: GA8. Proforma field: A4.
has OBO namespace: origin_of_mutation
in subset: camcur

fagaronine
type: Class
subclass of: unclassified chemical
comment: Proforma field: GA8. Proforma field: A4.
has OBO namespace: origin_of_mutation
in subset: camcur

formaldehyde
type: Class
subclass of: unclassified chemical
comment: Proforma field: GA8. Proforma field: A4.
has OBO namespace: origin_of_mutation
in subset: camcur

hesperidine
type: Class
subclass of: unclassified chemical
comment: Proforma field: GA8. Proforma field: A4.
has OBO namespace: origin_of_mutation
in subset: camcur

hexamethylmelamine
type: Class
subclass of: unclassified chemical
comment: Proforma field: GA8. Proforma field: A4.
has OBO namespace: origin_of_mutation
in subset: camcur
has related synonym: altretamine
has related synonym: HMM

hexamethylphosphoramide
type: Class
subclass of: unclassified chemical
comment: Proforma field: GA8. Proforma field: A4.
has OBO namespace: origin_of_mutation
in subset: camcur
has related synonym: HMPA

iodine
type: Class
subclass of: inorganic compound
comment: Proforma field: GA8. Proforma field: A4.
has OBO namespace: origin_of_mutation
in subset: camcur

Janus green B
type: Class
subclass of: unclassified chemical
comment: Proforma field: GA8. Proforma field: A4.
has OBO namespace: origin_of_mutation
in subset: camcur

methoxy diethylnitrosamine
type: Class
subclass of: unclassified chemical
comment: Proforma field: GA8. Proforma field: A4.
has OBO namespace: origin_of_mutation
in subset: camcur

natural gas
type: Class
subclass of: unclassified chemical
comment: Proforma field: GA8. Proforma field: A4.
has OBO namespace: origin_of_mutation
in subset: camcur

nitrosomethyl urea
type: Class
subclass of: unclassified chemical
comment: Proforma field: GA8. Proforma field: A4.
has OBO namespace: origin_of_mutation
in subset: camcur
has related synonym: MNU
has related synonym: N-methyl-N-nitrosourea

N-nitrosodimethylamine
type: Class
subclass of: unclassified chemical
comment: Proforma field: GA8. Proforma field: A4.
has OBO namespace: origin_of_mutation
in subset: camcur
has related synonym: DMN

p-N,N-di(2-chloroethyl)aminophenylvaleric acid
type: Class
subclass of: unclassified chemical
comment: Proforma field: GA8. Proforma field: A4.
has OBO namespace: origin_of_mutation
in subset: camcur
has related synonym: CB1356

p-N,N-di-(2-chloroethyl)amino-D-phenylalanine
type: Class
subclass of: unclassified chemical
comment: Proforma field: GA8. Proforma field: A4.
has OBO namespace: origin_of_mutation
in subset: camcur
has related synonym: CB3026

p-N,N-di-(2-chloroethyl)amino-DL-phenylalanine
type: Class
subclass of: unclassified chemical
comment: Proforma field: GA8. Proforma field: A4.
has OBO namespace: origin_of_mutation
in subset: camcur
has related synonym: melphalan
has related synonym: CB3007

p-N,N-di-(2-chloroethyl)amino-L-phenylalanine
type: Class
subclass of: unclassified chemical
comment: Proforma field: GA8. Proforma field: A4.
has OBO namespace: origin_of_mutation
in subset: camcur
has related synonym: CB3025

dominant temperature-sensitive lethal balancer
type: Class
subclass of: balancer stock
has OBO namespace: FlyBase miscellaneous CV

p-N,N-di-(2-chloroethyl)aminophenylethylamine
type: Class
subclass of: unclassified chemical
comment: Proforma field: GA8. Proforma field: A4.
has OBO namespace: origin_of_mutation
in subset: camcur
has related synonym: CB3034

p-p'-N,N-di(2-chloroethyl)aminophenoxyphenylalanine1
type: Class
subclass of: unclassified chemical
comment: Proforma field: GA8. Proforma field: A4.
has OBO namespace: origin_of_mutation
in subset: camcur
has related synonym: CB305

quinhydrone
type: Class
subclass of: unclassified chemical
comment: Proforma field: GA8. Proforma field: A4.
has OBO namespace: origin_of_mutation
in subset: camcur

S-2-chloroethylcysteine
type: Class
subclass of: unclassified chemical
comment: Proforma field: GA8. Proforma field: A4.
has OBO namespace: origin_of_mutation
in subset: camcur
has related synonym: CB1592

styryl quinoline
type: Class
subclass of: unclassified chemical
comment: Proforma field: GA8. Proforma field: A4.
has OBO namespace: origin_of_mutation
in subset: camcur
has related synonym: CB3086

triaziquone
type: Class
subclass of: unclassified chemical
comment: Proforma field: GA8. Proforma field: A4.
has OBO namespace: origin_of_mutation
in subset: camcur

triethylenemelamine
type: Class
subclass of: unclassified chemical
comment: Proforma field: GA8. Proforma field: A4.
has OBO namespace: origin_of_mutation
in subset: camcur
has related synonym: CB1246
has related synonym: TEM

allele assay method
type: Class
subclass of: allele descriptor
comment: Proforma field: GA19.
has OBO namespace: mode_of_assay

In transgenic Drosophila
type: Class
subclass of: allele assay method
has OBO namespace: mode_of_assay
in subset: camcur

Whole-organism transient assay
type: Class
subclass of: allele assay method
has OBO namespace: mode_of_assay
in subset: camcur

Drosophila cell culture
type: Class
subclass of: allele assay method
comment: Proforma field: GA19.
has OBO namespace: mode_of_assay
in subset: camcur
has db xref: abbrev:3
  type: DbXref
  has URI: http://purl.org/obo/owl/abbrev#abbrev_3

In transgenic Drosophila (allele of one drosophilid species in genome of another drosophilid)
type: Class
subclass of: In transgenic Drosophila
comment: Proforma field: GA19.
has OBO namespace: mode_of_assay
in subset: camcur
has db xref: abbrev:5
  type: DbXref
  has URI: http://purl.org/obo/owl/abbrev#abbrev_5

Whole-organism transient assay (allele from one drosophilid species assayed in another drosophilid)
type: Class
subclass of: Whole-organism transient assay
comment: Proforma field: GA19.
has OBO namespace: mode_of_assay
in subset: camcur
has db xref: abbrev:6
  type: DbXref
  has URI: http://purl.org/obo/owl/abbrev#abbrev_6

In transgenic Drosophila (allele of foreign species in genome of drosophilid)
type: Class
subclass of: In transgenic Drosophila
comment: Proforma field: GA19.
has OBO namespace: mode_of_assay
in subset: camcur
has db xref: abbrev:7
  type: DbXref
  has URI: http://purl.org/obo/owl/abbrev#abbrev_7

Whole-organism transient assay (allele of foreign species assayed in drosophilid)
type: Class
subclass of: Whole-organism transient assay
comment: Proforma field: GA19.
has OBO namespace: mode_of_assay
in subset: camcur
has db xref: abbrev:8
  type: DbXref
  has URI: http://purl.org/obo/owl/abbrev#abbrev_8

stock descriptor
type: Class
subclass of: descriptor
has OBO namespace: FlyBase miscellaneous CV

extracted wild-type chromosome
type: Class
subclass of: molecular extract
has OBO namespace: FlyBase miscellaneous CV

laboratory stock
type: Class
subclass of: ObsoleteClass
comment: I don't think this is a useful term.
has OBO namespace: FlyBase miscellaneous CV

selected wild-type stock
type: Class
subclass of: wild-type stock
has OBO namespace: FlyBase miscellaneous CV

wild-type stock
type: Class
subclass of: living stock
subclass of: Restriction
  on property: part_of
  some values from: San Diego Drosophila Species Stock Center
has OBO namespace: FlyBase miscellaneous CV

isogenic stock
type: Class
subclass of: living stock
has OBO namespace: FlyBase miscellaneous CV

genetic interaction qualifier
type: Class
subclass of: qualifier
has OBO namespace: genetic_interaction_type

suppressor
type: Class
subclass of: genetic interaction qualifier
comment: Proforma field: GA28a-q. Proforma field: GA29a-q. Proforma field: GA28b-q. Proforma field: GA29b-q.
has OBO namespace: genetic_interaction_type

suppressible
type: Class
subclass of: genetic interaction qualifier
comment: Proforma field: GA28a-q. Proforma field: GA29a-q. Proforma field: GA28b-q. Proforma field: GA29b-q.
has OBO namespace: genetic_interaction_type
in subset: camcur

enhancer
type: Class
subclass of: genetic interaction qualifier
comment: Proforma field: GA28a-q. Proforma field: GA29a-q. Proforma field: GA28b-q. Proforma field: GA29b-q.
has OBO namespace: genetic_interaction_type

enhanceable
type: Class
subclass of: genetic interaction qualifier
comment: Proforma field: GA28a-q. Proforma field: GA29a-q. Proforma field: GA28b-q. Proforma field: GA29b-q.
has OBO namespace: genetic_interaction_type
in subset: camcur

non-enhancer
type: Class
subclass of: genetic interaction qualifier
comment: Proforma field: GA28a-q. Proforma field: GA29a-q. Proforma field: GA28b-q. Proforma field: GA29b-q.
has OBO namespace: genetic_interaction_type

non-enhanceable
type: Class
subclass of: genetic interaction qualifier
comment: Proforma field: GA28a-q. Proforma field: GA29a-q. Proforma field: GA28b-q. Proforma field: GA29b-q.
has OBO namespace: genetic_interaction_type
in subset: camcur

non-suppressor
type: Class
subclass of: genetic interaction qualifier
comment: Proforma field: GA28a-q. Proforma field: GA29a-q. Proforma field: GA28b-q. Proforma field: GA29b-q.
has OBO namespace: genetic_interaction_type

non-suppressible
type: Class
subclass of: genetic interaction qualifier
comment: Proforma field: GA28a-q. Proforma field: GA29a-q. Proforma field: GA28b-q. Proforma field: GA29b-q.
has OBO namespace: genetic_interaction_type
in subset: camcur

dominant temperature-sensitive lethal balancer for chromosome 2
type: Class
subclass of: ObsoleteClass
has OBO namespace: FlyBase miscellaneous CV

dominant temperature-sensitive lethal balancer for chromosome 3
type: Class
subclass of: ObsoleteClass
has OBO namespace: FlyBase miscellaneous CV

DrosDel Project deficiency core kit stock
type: Class
subclass of: DrosDel Project deficiency stock
subclass of: deficiency stock
has OBO namespace: FlyBase miscellaneous CV

Bloomington Stock Center deficiency kit stock
type: Class
subclass of: deficiency stock
has OBO namespace: FlyBase miscellaneous CV

Exelixis deficiency kit stock
type: Class
subclass of: deficiency stock
has OBO namespace: FlyBase miscellaneous CV

duplication kit stock
type: Class
subclass of: ObsoleteClass
has OBO namespace: FlyBase miscellaneous CV

Cambridge 2 duplication kit stock
type: Class
subclass of: duplication stock
has OBO namespace: FlyBase miscellaneous CV

Bloomington duplication kit stock
type: Class
subclass of: duplication stock
has OBO namespace: FlyBase miscellaneous CV

Gene Disruption Project stock
type: Class
subclass of: living stock
has OBO namespace: FlyBase miscellaneous CV

sequenced strain
type: Class
subclass of: stock descriptor
has OBO namespace: FlyBase miscellaneous CV

Golic gene replacement kit stock
type: Class
subclass of: living stock
has OBO namespace: FlyBase miscellaneous CV

Golic laboratory gene replacement kit stock
type: Class
subclass of: ObsoleteClass
has OBO namespace: FlyBase miscellaneous CV

stock by cytotype
type: Class
subclass of: living stock
has OBO namespace: FlyBase miscellaneous CV

H cytotype stock
type: Class
subclass of: stock by cytotype
has OBO namespace: FlyBase miscellaneous CV

hobo family transposable element insertions present
type: Class
subclass of: ObsoleteClass
has OBO namespace: FlyBase miscellaneous CV

hobo family transposable element insertions absent
type: Class
subclass of: ObsoleteClass
has OBO namespace: FlyBase miscellaneous CV

P cytotype stock
type: Class
subclass of: stock by cytotype
has OBO namespace: FlyBase miscellaneous CV

P-element family transposable element insertions absent
type: Class
subclass of: ObsoleteClass
has OBO namespace: FlyBase miscellaneous CV

P-element family transposable element insertions present
type: Class
subclass of: ObsoleteClass
has OBO namespace: FlyBase miscellaneous CV

mapping stock
type: Class
subclass of: living stock
has OBO namespace: FlyBase miscellaneous CV

visible allele recombination mapping stock
type: Class
subclass of: mapping stock
has OBO namespace: FlyBase miscellaneous CV

editorial
type: Class
subclass of: publication class
comment: Proforma field: P1.
has OBO namespace: pub_type
in subset: camcur

meeting report
type: Class
subclass of: publication class
comment: Proforma field: P1.
has OBO namespace: pub_type
in subset: camcur

compendium
type: Class
subclass of: publication class
has OBO namespace: pub_type
in subset: camcur

subset
type: Class
subclass of: spatial qualifier
has OBO namespace: expression_qualifier
in subset: camcur
has definition: Restricted to unknown subtype(s) of a specifed type.
  type: Definition
  has db xref: FB:DS
    type: DbXref
    has URI: http://purl.org/obo/owl/FB#FB_DS

embryonic pattern qualifier
type: Class
subclass of: spatial qualifier
has OBO namespace: embryonic_pattern_qualifier

Vienna Drosophila RNAi Center
type: Class
subclass of: stock center collection
has OBO namespace: FlyBase miscellaneous CV
has exact synonym: VDRC
has exact synonym: Vienna

frozen specimen
type: Class
subclass of: preserved specimen
has OBO namespace: FlyBase miscellaneous CV

mutant stock
type: Class
subclass of: living stock
subclass of: Restriction
  on property: part_of
  some values from: San Diego Drosophila Species Stock Center
has OBO namespace: FlyBase miscellaneous CV

DrosDel Project deficiency stock
type: Class
subclass of: deficiency stock
has OBO namespace: FlyBase miscellaneous CV

deficiency stock
type: Class
subclass of: living stock
subclass of: Restriction
  on property: part_of
  some values from: Bloomington Drosophila Stock Center
has OBO namespace: FlyBase miscellaneous CV

inbred line
type: Class
subclass of: wild-type stock
has OBO namespace: FlyBase miscellaneous CV

isofemale line
type: Class
subclass of: wild-type stock
has OBO namespace: FlyBase miscellaneous CV

recently collected stock
type: Class
subclass of: wild-type stock
has OBO namespace: FlyBase miscellaneous CV
has definition: A stock established from flies collected in the wild within the past 3 years.
  type: Definition
  has db xref: FB:KM
    type: DbXref
    has URI: http://purl.org/obo/owl/FB#FB_KM

transposable element-containing stock
type: Class
subclass of: mutant stock
has OBO namespace: FlyBase miscellaneous CV

duplication stock
type: Class
subclass of: living stock
subclass of: Restriction
  on property: part_of
  some values from: Bloomington Drosophila Stock Center
has OBO namespace: FlyBase miscellaneous CV

body size defective
type: Class
subclass of: visible
has OBO namespace: phenotypic_class
in subset: camcur

conference proceedings
type: Class
subclass of: publication class
has OBO namespace: pub_type

website
type: Class
subclass of: publication class
has OBO namespace: pub_type

cell adhesion defective
type: Class
subclass of: phenotypic class
has OBO namespace: phenotypic_class
in subset: camcur

hatching defective
type: Class
subclass of: phenotypic class
has OBO namespace: phenotypic_class

eclosion defective
type: Class
subclass of: phenotypic class
has OBO namespace: phenotypic_class

cell cycle defective
type: Class
subclass of: phenotypic class
has OBO namespace: phenotypic_class
in subset: camcur

endomitotic cell cycle defective
type: Class
subclass of: cell cycle defective
has OBO namespace: phenotypic_class

sequenced whole genome stock
type: Class
subclass of: living stock
subclass of: Restriction
  on property: part_of
  some values from: San Diego Drosophila Species Stock Center
has OBO namespace: FlyBase miscellaneous CV

phiC31 based integration system
type: Class
subclass of: living stock
has OBO namespace: FlyBase miscellaneous CV

phiC31 docking site stock
type: Class
subclass of: phiC31 based integration system
has OBO namespace: FlyBase miscellaneous CV

multi-female collection
type: Class
subclass of: wild-type stock
has OBO namespace: FlyBase miscellaneous CV

parental effect
type: Class
subclass of: phenotype qualifier
has OBO namespace: genotype_to_phenotype_relation
has definition: Parental effects describe the dependence of the expression of a phenotypic attribute of an allele on the parent from which that allele is inherited.
  type: Definition
  has db xref: FB:rd
    type: DbXref
    has URI: http://purl.org/obo/owl/FB#FB_rd

cell autonomy qualifier
type: Class
subclass of: phenotype qualifier
has OBO namespace: genotype_to_phenotype_relation
has definition: Definition
  label: Cell autonomy statements describe the cellular focus of mutant phenotype, generally revealed by genetic mosaic analysis, in terms of whether the mutant has its phenotypic effect limited to, or not limited to, cells of the mutant genotype.
  has db xref: FB:rd
    type: DbXref
    has URI: http://purl.org/obo/owl/FB#FB_rd

gene descriptor
type: Class
subclass of: ObsoleteClass
has OBO namespace: FlyBase miscellaneous CV

polymorphism assay
type: Class
subclass of: ObsoleteClass
has OBO namespace: FlyBase miscellaneous CV

RFLP
type: Class
subclass of: ObsoleteClass
has OBO namespace: FlyBase miscellaneous CV
has related synonym: restriction fragment length polymorphism

DNA sequence variant
type: Class
subclass of: ObsoleteClass
has OBO namespace: FlyBase miscellaneous CV

allele descriptor
type: Class
subclass of: descriptor
has OBO namespace: FlyBase miscellaneous CV

phenotype qualifier
type: Class
subclass of: qualifier
has OBO namespace: FlyBase miscellaneous CV

qualitative qualifier
type: Class
subclass of: phenotype qualifier
has OBO namespace: FlyBase miscellaneous CV

clone qualifier
type: Class
subclass of: phenotype qualifier
has OBO namespace: clone_qualifier

nitrogen mustard
type: Class
subclass of: alkylating agent
comment: Proforma field: GA8. Proforma field: A4.
has OBO namespace: origin_of_mutation
in subset: camcur
has related synonym: mechlorethamine
has related synonym: HN2
has related synonym: CB1414
has related synonym: 2-chloro-N-(2-chloroethyl)-N-methylethanamine

1,4-dimethanesulfonoxybutane
type: Class
subclass of: unclassified chemical
comment: Proforma field: GA8. Proforma field: A4.
has OBO namespace: origin_of_mutation
in subset: camcur
has related synonym: CB2041
has related synonym: busulfan

p-N,N-di-(2-chloroethyl)aminophenylbutyric acid
type: Class
subclass of: unclassified chemical
comment: Proforma field: GA8. Proforma field: A4.
has OBO namespace: origin_of_mutation
in subset: camcur
has related synonym: chlorambucil
has related synonym: CB1348

living stock
type: Class
subclass of: stock descriptor
has OBO namespace: FlyBase miscellaneous CV

molecular extract
type: Class
subclass of: stock descriptor
has OBO namespace: FlyBase miscellaneous CV

preserved specimen
type: Class
subclass of: stock descriptor
has OBO namespace: FlyBase miscellaneous CV

E cytotype stock
type: Class
subclass of: stock by cytotype
has OBO namespace: FlyBase miscellaneous CV

M cytotype stock
type: Class
subclass of: stock by cytotype
has OBO namespace: FlyBase miscellaneous CV

genomic DNA
type: Class
subclass of: molecular extract
has OBO namespace: FlyBase miscellaneous CV

ethanol-preserved specimen
type: Class
subclass of: preserved specimen
has OBO namespace: FlyBase miscellaneous CV

pinned specimen
type: Class
subclass of: preserved specimen
has OBO namespace: FlyBase miscellaneous CV

fluorescent balancer
type: Class
subclass of: balancer stock
has OBO namespace: FlyBase miscellaneous CV

lacZ balancer
type: Class
subclass of: balancer stock
has OBO namespace: FlyBase miscellaneous CV

laboratory wild-type stock
type: Class
subclass of: wild-type stock
has OBO namespace: FlyBase miscellaneous CV

collection
type: Class
subclass of: stock descriptor
has OBO namespace: FlyBase miscellaneous CV

stock center collection
type: Class
subclass of: collection
has OBO namespace: FlyBase miscellaneous CV

laboratory collection
type: Class
subclass of: collection
has OBO namespace: FlyBase miscellaneous CV

Saxton laboratory
type: Class
subclass of: laboratory collection
has OBO namespace: FlyBase miscellaneous CV

Garcia-Bellido laboratory
type: Class
subclass of: laboratory collection
has OBO namespace: FlyBase miscellaneous CV

Nusslein-Volhard laboratory
type: Class
subclass of: laboratory collection
has OBO namespace: FlyBase miscellaneous CV

Carpenter laboratory
type: Class
subclass of: laboratory collection
has OBO namespace: FlyBase miscellaneous CV

Artavanis laboratory
type: Class
subclass of: ObsoleteClass
has OBO namespace: FlyBase miscellaneous CV
has related synonym: Harvard Medical School Exelixis Drosophila Collection

Exelixis Drosophila Stock Collection at Harvard Medical School
type: Class
subclass of: laboratory collection
has OBO namespace: FlyBase miscellaneous CV
has related synonym: Artavanis-Tsakonas laboratory

Bloomington Drosophila Stock Center
type: Class
subclass of: stock center collection
has OBO namespace: FlyBase miscellaneous CV
has exact synonym: Bloomington
has related synonym: BDSC
has related synonym: BSC

San Diego Drosophila Species Stock Center
type: Class
subclass of: stock center collection
has OBO namespace: FlyBase miscellaneous CV
has exact synonym: species stock center
has related synonym: Drosophila species stock center
has related synonym: Tucson

Szeged Drosophila Stock Centre
type: Class
subclass of: stock center collection
has OBO namespace: FlyBase miscellaneous CV
has related synonym: Szeged

Drosophila Genetic Resource Center
type: Class
subclass of: stock center collection
has OBO namespace: FlyBase miscellaneous CV
has related synonym: Kyoto
has related synonym: Kyoto stock center
has related synonym: DGRC

camcur
type: NamedIndividual
type: Subset
comment: camcur